{"text_format":"1","workbook":"xlsx","n_sheets":7,"sheets":["settings","register map","timing diagram","constants","messages","txt source","chart calc"],"not_rendered":{"charts":2,"images":4,"macros":1,"external_links":0,"defined_names":3,"comments":0,"pivot_tables":0},"unopened":[{"sheet":"timing diagram","index":2,"reason":"not_a_worksheet"}],"bounds":{"document_bytes":16777216,"sheet_cells":100000,"rows_first":2000,"rows_last":500,"rows_between":2000,"halvings":0,"cell_chars":16384,"cell_head_chars":4096},"cells_cut":0,"cells_raw":0,"read":"whole","date_system":"1900"}

{"sheet":"settings","index":0,"n_rows":156,"n_cols":11,"rows_kept":156,"cut":false,"hidden":false,"merged":[[7,0,7,10],[0,0,0,10],[1,4,1,5],[2,4,2,5],[3,4,4,5],[1,6,4,10],[2,1,2,3],[1,1,1,3],[3,1,3,3],[4,1,4,3],[5,1,5,10],[56,0,56,10],[62,0,62,10],[67,0,67,10],[34,0,34,10],[44,0,44,10],[40,0,40,10],[35,0,35,10],[39,0,39,10],[43,0,43,10],[27,0,27,10],[20,0,20,10],[15,0,15,10],[12,0,12,10],[8,0,8,10],[11,0,11,10],[26,0,26,10],[128,0,128,10],[123,0,123,10],[118,0,118,10],[107,0,107,10],[117,0,117,10],[127,0,127,10],[93,0,93,10],[76,0,76,10],[68,0,68,10],[63,0,63,10],[57,0,57,10],[81,0,81,10],[77,0,77,10],[74,0,74,10],[85,0,88,0],[85,5,88,5],[80,0,80,10],[73,0,73,10]]}
["EM8500 QUICK WIZARD"]
["Author","EM-Microelectronic SA",null,null,"User settings"]
["Date:","2025-08-29",null,null,"Calculation results"]
["Description:","EM8500 simplified configuration",null,null,{"$f":"IF(COUNTIF('register map'!F3:F28,\"\")<>26,messages!A65,IF(COUNTIF(F10:F156,\"ERROR*\")>0,messages!A42,IF(COUNTIF(F10:F156,\"WARNING*\")>0,messages!A67,messages!A79)))","v":"OK"}]
["Revision:",2.2000000000000002]
["Configuration description:"]
["Parameter","Value","Unit","Related Register Name","Value","Check","Note","DEC","WEIGHT",null,"User comments"]
["HARVESTER SETTINGS: refer to the chapter 2.2 of  \"App Note 85 Configuration\""]
["Harvester type: refer to the chapter 2.1 of e8500_app_note_hrv_param.pdf"]
["Harvester type","TEG","--",null,null,{"$f":"messages!A79","v":"OK"}]
["MPPT ratio",{"$f":"IF(B10=constants!B1,constants!H2,constants!B2)","v":0.5},"--","reg_mppt_ratio ",{"$f":"HLOOKUP(B11,constants!B2:N4,3,FALSE)","v":"0x00"},{"$f":"IF(B10=\"TEG\",IF(B11=0.5,messages!A79,messages!A51),IF(B10=\"Other\",messages!A79,IF(settings!B11<constants!G2,messages!A52,IF(settings!B11>constants!I2,messages!A52,messages!A79))))","v":"OK"}]
[]
["Harvester check settings: refer to the chapter 2.2 of e8500_app_note_hrv_param.pdf"]
["HRV check method",{"$f":"IF(B10=constants!B1,constants!C8,constants!B8)","v":"Open voltage"},"--","reg_v_hrv_cfg.hrv_check_vld",{"$f":"HLOOKUP(B14,constants!$B$8:$C$9,2,FALSE)","v":"'1'"},{"$f":"IF(AND(B14=constants!B8,settings!B10=constants!B1),messages!A54,IF(AND(settings!B14=constants!C8,settings!B10=constants!C1),messages!A53,messages!A79))","v":"OK"},"Open voltage is preferable for TEG ; Short cut current preferable for Solar cell",{"$f":"HLOOKUP(B14,constants!$B$8:$C$10,3,FALSE)","v":1},64]
["Maximum battery and application voltage:",3.6,"V","reg_v_bat_max_hi",{"$f":"IF((TRUNC(B15/constants!D64-1)+1)>9,\"0x\"&DEC2HEX(TRUNC(B15/constants!D64-1)+1),\"0x0\"&DEC2HEX(TRUNC(B15/constants!D64-1)+1))","v":"0x30"},{"$f":"IF(B15>constants!D67,messages!A14,messages!A79)","v":"OK"},null,{"$f":"(TRUNC(B15/constants!D64-1)+1)","v":48},1]
["Harvester check settings for a TEG: refer to the chapter 2.2.1 of e8500_app_note_hrv_param.pdf"]
["Minimum battery and application voltage:",2.7,"V","reg_v_bat_min_lo",{"$f":"IF(H17>9,\"0x\"&DEC2HEX(H17),\"0x0\"&DEC2HEX(H17))","v":"0x25"},{"$f":"IF(B17<constants!B68,messages!A17,IF(B15-B17<0.6,messages!A18,messages!A79))","v":"OK"},"Set the absolute minimum battery voltage",{"$f":"(TRUNC(B17/constants!B64-1)+1)","v":37},1]
[{"$f":"IF(B14=constants!C8,\"Unused\",\"HRV resistivity (Rteg)\")","v":"HRV resistivity (Rteg)"},120,"Ω",null,null,{"$f":"IF(AND(B14=constants!B8,B15<=2,B18>MAX(constants!B15:B18)),messages!A5,IF(AND(B14=constants!B8,settings!B15<=3,B15>2,settings!B18>MAX(constants!C15:C18)),messages!A4,IF(AND(B14=constants!B8,B15>3,settings!B18>MAX(constants!D15:D18)),messages!A3,IF(B14<>constants!B8,messages!A80,messages!A79))))","v":"OK"}]
["Minimum HRV open voltage",{"$f":"IF(B14<>constants!B8,messages!A80,IF(B10=constants!C1,IF(B15<=2,IF(B18<=constants!B15,constants!E15,IF(settings!B18<=constants!B16,constants!E16,IF(settings!B18<=constants!B17,constants!E17,IF(settings!B18<=constants!B18,constants!E18,constants!B19)))),IF(B15<=3,IF(B18<=constants!C15,constants!E15,IF(settings!B18<=constants!C16,constants!E16,IF(settings!B18<=constants!C17,constants!E17,IF(settings!B18<=constants!C18,constants!E18,constants!C19)))),IF(B18<=constants!D15,constants!E15,IF(settings!B18<=constants!D16,constants!E16,IF(settings!B18<=constants!D17,constants!E17,IF(settings!B18<=constants!D18,constants!E18,constants!D19)))))),messages!A80))","v":288},"mV","reg_v_hrv_cfg.v_hrv_min",{"$f":"IF(B19<>messages!A80,VLOOKUP(B19,constants!E15:F18,2,FALSE),\"0x01\")","v":"0x03"},null,"Below that level the EM8500 DCDC is deactivated",{"$f":"IF(B19<>messages!A80,VLOOKUP(B19,constants!E15:G18,3,FALSE),1)","v":3},1]
["Pin_min",{"$f":"IF(B19=messages!A80,messages!A80,IF(B19=constants!B19,constants!B19,1000000*(0.001*settings!B19)^2/(4*settings!B18)))","v":172.80000000000004},"uW",null,null,null,"Minimum power the EM8500 can harvest in such condition"]
{"$rows_left_out":137}
{"sheet":"register map","index":1,"n_rows":67,"n_cols":16,"rows_kept":67,"cut":false,"hidden":false,"merged":[[56,8,56,10],[57,8,57,10],[63,8,63,10],[64,8,64,10],[65,8,65,10],[58,8,58,10],[59,8,59,10],[60,8,60,10],[61,8,61,10],[62,8,62,10],[51,8,51,10],[52,8,52,10],[53,8,53,10],[54,8,54,10],[55,8,55,10],[49,8,49,10],[50,8,50,10],[31,8,31,10],[32,8,32,10],[25,9,25,10],[26,8,26,10],[40,8,40,10],[46,8,46,10],[47,8,47,10],[41,8,41,10],[42,8,42,10],[43,8,43,10],[44,8,44,10],[48,8,48,10],[29,8,29,10],[30,8,30,10],[45,8,45,10],[16,9,16,10],[37,8,37,10],[38,8,38,10],[39,8,39,10],[33,8,33,10],[34,8,34,10],[35,8,35,10],[36,8,36,10],[28,8,28,10],[21,8,21,10],[24,8,24,10],[23,8,23,10],[22,8,22,10],[27,8,27,10],[20,8,20,10],[11,8,11,10],[10,8,10,10],[6,9,6,10],[5,8,5,10],[8,8,8,9],[13,8,13,10],[12,8,12,10],[14,8,14,10],[15,8,15,10],[17,8,19,10],[4,8,4,10],[3,8,3,10],[9,8,9,10],[7,8,7,10],[0,0,0,6],[1,8,1,10],[2,8,2,10],[0,8,0,9]]}
["EM8500 register map",null,null,null,null,null,null,null,{"$f":"IF(L10<=L11,messages!A44,IF(L15<=L16,messages!A45,IF(OR(L12<=L14,L13<=L14),messages!A46,IF(OR(L12>=L16,L13>=L16),messages!A47,IF(OR(L12>=L11,L13>=L11),messages!A48,IF(MID(H22,3,2)=\"00\",messages!A49,IF(COUNTIF(F3:F28,\"\")<>26,messages!A65,settings!E4)))))))","v":"OK"}]
["Register name in EEPROM area","Address","Related register","Calc Value [hex]","DEC","Overwrite\n[hex]","Effective\n[hex]",null,"Physical representation"]
["eeprom0","0x40","reg_t_hrv_period",{"$f":"settings!E32","v":"0x04"},null,null,{"$f":"IF(F3=\"\",D3,IF(HEX2DEC(F3)<16,\"0x0\"&F3,\"0x\"&F3))","v":"0x04"},{"$f":"TEXT(HEX2BIN(MID(G3,3,2)),\"00000000\")","v":"00000100"},{"$f":"VLOOKUP(VALUE(MID(H3,6,3)),constants!A51:C58,3,FALSE)&\" ms\"","v":"4096 ms"}]
["eeprom1","0x41","reg_t_hrv_meas",{"$f":"settings!E31","v":"0x03"},null,null,"0x03",{"$f":"TEXT(HEX2BIN(MID(G4,3,2)),\"00000000\")","v":"00000011"},{"$f":"VLOOKUP(VALUE(MID(H4,6,3)),constants!A51:B58,2,FALSE)&\" ms\"","v":"128 ms"}]
["eeprom2","0x42","reg_t_sts_period",{"$f":"settings!E62","v":"0x01"},null,null,"0x01","00000001",{"$f":"VLOOKUP(BIN2DEC(MID(H5,6,3)),constants!A78:B85,2,FALSE)&\" ms\"","v":"2 ms"}]
["eeprom3","0x43","reg_t_lts_period",{"$f":"settings!E79","v":"0x02"},null,null,"0x02","00000010",{"$f":"VLOOKUP(BIN2DEC(MID(H6,6,3)),constants!A88:B95,2,FALSE)&\" ms\"","v":"16 ms"}]
["eeprom4","0x44","reg_v_hrv_cfg",{"$f":"IF(E7>15,\"0x\"&DEC2HEX(E7),\"0x0\"&DEC2HEX(E7))","v":"0x43"},{"$f":"(PRODUCT(settings!H14:I14)+PRODUCT(settings!H19:I19))","v":67},null,"0x43","01000011",{"$f":"IF(MID(H7,2,1)=\"1\",constants!B186,constants!B185)","v":"HRV check by Vopen-voltage"},{"$f":"\"v_hrv_min: \"&TEXT((BIN2DEC(MID(H7,3,6))+1)*constants!C64,\"0.000\")&\" V (TYP)\"","v":"v_hrv_min: 0.292 V (TYP)"}]
["eeprom5","0x45","reg_hrv_check_lvl",{"$f":"settings!E25","v":"0x00"},null,null,"0x00","00000000",{"$f":"(BIN2DEC(MID(H8,5,4))+1)&\" µA\"","v":"1 µA"}]
["eeprom6","0x46","reg_lts_cfg",{"$f":"IF(E9>15,\"0x\"&DEC2HEX(E9),\"0x0\"&DEC2HEX(E9))","v":"0x00"},{"$f":"PRODUCT(settings!H37:I37)+PRODUCT(settings!H38:I38)+PRODUCT(settings!H39:I39)","v":0},null,"0x00","00000000",{"$f":"IF(MID(H9,7,1)=\"0\",constants!C190,IF(MID(H9,6,1)=\"0\",constants!C191&\" & \"&constants!B190,constants!C191&\" & \"&constants!B191))","v":"rechargeable battery"},null,{"$f":"IF(MID(H9,8,1)=\"0\",constants!D190,constants!D191)","v":"battery protection on"}]
["eeprom7","0x47","reg_v_bat_max_hi",{"$f":"settings!E42","v":"0x30"},null,null,"0x30","00110000",{"$f":"TEXT((BIN2DEC(MID(H10,3,6))+1)*constants!$C$64,\"0.000\")&\" V (TYP)\"","v":"3.577 V (TYP)"},null,null,{"$f":"BIN2DEC(H10)","v":48}]
["eeprom8","0x48","reg_v_bat_max_lo",{"$f":"settings!E76","v":"0x2D"},null,null,"0x2D","00101101",{"$f":"TEXT((BIN2DEC(MID(H11,3,6))+1)*constants!$C$64,\"0.000\")&\" V (TYP)\"","v":"3.358 V (TYP)"},null,null,45]
["eeprom9","0x49","reg_v_bat_min_hi_dis",{"$f":"settings!E66","v":"0x26"},null,null,"0x26","00100110",{"$f":"TEXT((BIN2DEC(MID(H12,3,6))+1)*constants!$C$64,\"0.000\")&\" V (TYP)\"","v":"2.847 V (TYP)"},null,null,38]
["eeprom10","0x4A","reg_v_bat_min_hi_con",{"$f":"settings!E67","v":"0x26"},null,null,"0x26","00100110",{"$f":"TEXT((BIN2DEC(MID(H13,3,6))+1)*constants!$C$64,\"0.000\")&\" V (TYP)\"","v":"2.847 V (TYP)"},null,null,38]
["eeprom11","0x4B","reg_v_bat_min_lo",{"$f":"settings!E17","v":"0x25"},null,null,"0x25","00100101",{"$f":"TEXT((BIN2DEC(MID(H14,3,6))+1)*constants!$C$64,\"0.000\")&\" V (TYP)\"","v":"2.774 V (TYP)"},null,null,37]
["eeprom12","0x4C","reg_v_apl_max_hi",{"$f":"settings!E43","v":"0x3F"},null,null,"0x3F","00111111",{"$f":"TEXT((BIN2DEC(MID(H15,3,6))+1)*constants!$C$64,\"0.000\")&\" V (TYP)\"","v":"4.672 V (TYP)"},null,null,63]
["eeprom13","0x4D","reg_v_apl_max_lo",{"$f":"settings!E73","v":"0x3E"},null,null,"0x3E","00111110",{"$f":"TEXT((BIN2DEC(MID(H16,3,6))+1)*constants!$C$64,\"0.000\")&\" V (TYP)\"","v":"4.599 V (TYP)"},null,null,62]
["eeprom14","0x4E","reg_ldo_cfg",{"$f":"IF(E17>15,\"0x\"&DEC2HEX(E17),\"0x0\"&DEC2HEX(E17))","v":"0xFF"},{"$f":"PRODUCT(settings!H83:I83)+PRODUCT(settings!H92:I92)+PRODUCT(settings!H93:I93)+PRODUCT(settings!H104:I104)","v":255},null,"0xFF","11111111",{"$f":"\"VAUX LDO: \"&VLOOKUP(VALUE(MID($H$17,2,3)),constants!$A$129:$B$136,2,FALSE)&\" V\"","v":"VAUX LDO: 2.6 V"},{"$f":"\"ULP LDO: \"&VLOOKUP(VALUE(MID($H$17,6,3)),constants!$A$114:$B$121,2,FALSE)&\" V\"","v":"ULP LDO: 2.6 V"}]
["eeprom15","0x4F","reg_pwr_cfg",{"$f":"IF(E18>15,\"0x\"&DEC2HEX(E18),\"0x0\"&DEC2HEX(E18))","v":"0x00"},{"$f":"PRODUCT(settings!H85:I85)+PRODUCT(settings!H105:I105)+PRODUCT(settings!H106:I106)+PRODUCT(settings!H107:I107)+PRODUCT(settings!H115:I115)+PRODUCT(settings!H116:I116)+PRODUCT(settings!H117:I117)+PRODUCT(settings!H120:I120)","v":0},null,"0x00","00000000"]
["eeprom16","0x50","reg_vaux_cfg",{"$f":"IF(E19>15,\"0x\"&DEC2HEX(E19),\"0x0\"&DEC2HEX(E19))","v":"0x15"},{"$f":"PRODUCT(settings!H101:I101)+PRODUCT(settings!H102:I102)+PRODUCT(settings!H103:I103)","v":21},null,"0x15","00010101"]
["eeprom17","0x51","reg_vaux_gnd_cfg",{"$f":"IF(E20>15,\"0x\"&DEC2HEX(E20),\"0x0\"&DEC2HEX(E20))","v":"0x00"},{"$f":"PRODUCT(settings!H112:I112)+PRODUCT(settings!H113:I113)+PRODUCT(settings!H114:I114)","v":0},null,"0x00","00000000"]
{"$rows_left_out":48}
{"sheet":"constants","index":3,"n_rows":196,"n_cols":17,"rows_kept":196,"cut":false,"hidden":true,"merged":[[11,1,11,3],[23,4,23,6],[47,0,49,0],[48,1,49,1],[47,3,49,3],[47,4,49,4],[47,5,49,5],[23,1,23,3]]}
["Harvester type","Solar cell","TEG"]
["MPPT ratio",{"$f":"2/4","v":0.5},{"$f":"3/5","v":0.6},{"$f":"4/6","v":0.66666666666666663},{"$f":"5/7","v":0.7142857142857143},{"$f":"6/8","v":0.75},{"$f":"7/9","v":0.77777777777777779},{"$f":"8/10","v":0.8},{"$f":"9/11","v":0.81818181818181823},{"$f":"10/12","v":0.83333333333333337},{"$f":"11/13","v":0.84615384615384615},{"$f":"12/14","v":0.8571428571428571},{"$f":"13/15","v":0.8666666666666667},{"$f":"14/16","v":0.875},{"$f":"14/16","v":0.875},{"$f":"14/16","v":0.875},{"$f":"14/16","v":0.875}]
["reg_mppt_ratio [dec]",0,{"$f":"B3+1","v":1},{"$f":"C3+1","v":2},3,4,5,6,7,8,9,10,11,12,13,14,15]
["reg_mppt_ratio [hex]",{"$f":"\"0x0\"&DEC2HEX(B3)","v":"0x00"},{"$f":"\"0x0\"&DEC2HEX(C3)","v":"0x01"},"0x02","0x03","0x04","0x05","0x06","0x07","0x08","0x09","0x0A","0x0B","0x0C",{"$f":"\"0x0\"&DEC2HEX(O3)","v":"0x0D"},"0x0E","0x0F"]
[null,0,1,10,11,100,101,110,111,1000,1001,1010,1011,1100,1101,1110,1111]
[null,0.5,0.6,0.66666666666666663,0.7142857142857143,0.75,0.77777777777777779,0.8,0.81818181818181823,0.83333333333333337,0.84615384615384615,0.8571428571428571,0.8666666666666667,0.875,0.875,0.875,0.875]
[]
["HRV check method","Open voltage","Short-cut current"]
["reg_v_hrv_cfg.hrv_check_vld","'1'","'0'"]
[null,1,0]
[]
[null,"Maximum TEG internal resistivity"]
[null,"Vout range","Vout range","Vout range"]
["Vov min","1.5V to 2V","2V to 3V","3V to 3.6V","Vov min","v_hrv_min","v_hrv_min"]
[216,830,410,80,{"$f":"A15","v":216},"0x02",2]
[288,2980,1490,290,{"$f":"A16","v":288},"0x03",3]
[359,5000,5000,1160,{"$f":"A17","v":359},"0x04",4]
[431,5000,5000,3350,{"$f":"A18","v":431},"0x05",5]
[null,"Out of range","Out of range","Out of range"]
[]
{"$rows_left_out":177}
{"sheet":"messages","index":4,"n_rows":81,"n_cols":1,"rows_kept":81,"cut":false,"hidden":true,"merged":[]}
["Exception messages"]
["ERRORS:"]
[{"$f":"(\"ERROR: TEG resistivity cannot be higher than \"&constants!D18&\" Ohm when v_bat_max_hi > 3V\")","v":"ERROR: TEG resistivity cannot be higher than 3350 Ohm when v_bat_max_hi > 3V"}]
[{"$f":"(\"ERROR: TEG resistivity cannot be higher than \"&constants!C18&\" Ohm when v_bat_max_hi is in the range 2V-3V\")","v":"ERROR: TEG resistivity cannot be higher than 5000 Ohm when v_bat_max_hi is in the range 2V-3V"}]
[{"$f":"(\"ERROR: TEG resistivity cannot be higher than \"&constants!B18&\" Ohm when v_bat_max_hi < 2V\")","v":"ERROR: TEG resistivity cannot be higher than 5000 Ohm when v_bat_max_hi < 2V"}]
["ERROR: TEG resistivity shall not be higher than 5000 Ohm"]
[{"$f":"\"ERROR: Maximum HRV open voltage higher than \"&constants!D22&\" V\"","v":"ERROR: Maximum HRV open voltage higher than 1.8 V"}]
["ERROR: Vpp_min is too low for v_bat_max_hi range"]
["ERROR: Chrv is out of range 4.7uF - 10uF"]
["ERROR: Effective Ihrv_lim is lower than absolute minimum allowed"]
["ERROR: t_hrv_meas longer than maximum configurable value"]
[{"$f":"\"ERROR: Effective t_hrv_meas shorter than \"&settings!B30&\" ms\"","v":"ERROR: Effective t_hrv_meas shorter than 3 ms"}]
["ERROR: t_hrv_period too short compare to t_hrv_meas"]
[{"$f":"\"ERROR: max battery voltage is set higher than \"&constants!$D$67&\"V\"","v":"ERROR: max battery voltage is set higher than 4.2V"}]
["ERROR: v_apl_max_hi is set lower or too close to v_bat_min_lo"]
[{"$f":"\"ERROR: v_apl_max_hi is set higher than \"&constants!$D$67&\"V\"","v":"ERROR: v_apl_max_hi is set higher than 4.2V"}]
[{"$f":"\"ERROR: min battery voltage is lower than \"&constants!B68&\"V\"","v":"ERROR: min battery voltage is lower than 1.47V"}]
["ERROR: min & max battery voltages are too close"]
["ERROR: v_bat_max_hi is set lower or too close to v_bat_min_lo"]
[{"$f":"\"ERROR: Csup too low, shall be at least \"&constants!B71&\"uF when ULP LDO is used\"","v":"ERROR: Csup too low, shall be at least 1uF when ULP LDO is used"}]
{"$rows_left_out":62}
{"sheet":"txt source","index":5,"n_rows":53,"n_cols":2,"rows_kept":53,"cut":false,"hidden":true,"merged":[]}
[{"$f":"'register map'!B3","v":"0x40"},{"$f":"'register map'!G3","v":"0x04"}]
[{"$f":"'register map'!B4","v":"0x41"},{"$f":"'register map'!G4","v":"0x03"}]
[{"$f":"'register map'!B5","v":"0x42"},{"$f":"'register map'!G5","v":"0x01"}]
[{"$f":"'register map'!B6","v":"0x43"},{"$f":"'register map'!G6","v":"0x02"}]
[{"$f":"'register map'!B7","v":"0x44"},{"$f":"'register map'!G7","v":"0x43"}]
[{"$f":"'register map'!B8","v":"0x45"},{"$f":"'register map'!G8","v":"0x00"}]
[{"$f":"'register map'!B9","v":"0x46"},{"$f":"'register map'!G9","v":"0x00"}]
[{"$f":"'register map'!B10","v":"0x47"},{"$f":"'register map'!G10","v":"0x30"}]
[{"$f":"'register map'!B11","v":"0x48"},{"$f":"'register map'!G11","v":"0x2D"}]
[{"$f":"'register map'!B12","v":"0x49"},{"$f":"'register map'!G12","v":"0x26"}]
[{"$f":"'register map'!B13","v":"0x4A"},{"$f":"'register map'!G13","v":"0x26"}]
[{"$f":"'register map'!B14","v":"0x4B"},{"$f":"'register map'!G14","v":"0x25"}]
[{"$f":"'register map'!B15","v":"0x4C"},{"$f":"'register map'!G15","v":"0x3F"}]
[{"$f":"'register map'!B16","v":"0x4D"},{"$f":"'register map'!G16","v":"0x3E"}]
[{"$f":"'register map'!B17","v":"0x4E"},{"$f":"'register map'!G17","v":"0xFF"}]
[{"$f":"'register map'!B18","v":"0x4F"},{"$f":"'register map'!G18","v":"0x00"}]
[{"$f":"'register map'!B19","v":"0x50"},{"$f":"'register map'!G19","v":"0x15"}]
[{"$f":"'register map'!B20","v":"0x51"},{"$f":"'register map'!G20","v":"0x00"}]
[{"$f":"'register map'!B21","v":"0x52"},{"$f":"'register map'!G21","v":"0x00"}]
[{"$f":"'register map'!B22","v":"0x53"},{"$f":"'register map'!G22","v":"0x50"}]
{"$rows_left_out":34}
{"sheet":"chart calc","index":6,"n_rows":376,"n_cols":27,"rows_kept":376,"cut":false,"hidden":true,"merged":[[72,24,72,26],[72,2,72,3],[72,4,72,5],[7,2,7,7],[7,9,7,11],[72,8,72,9],[72,18,72,20],[72,6,72,7],[72,21,72,23]]}
["EM8500 chart illustration calculation"]
["Description","The timing diagram is divided in 3 phases:"]
[null,"-1. start-up phase (ULV DCDC or connection to LTS depending if STS/LTS can be disconnected)"]
[null,"-2. STS maintaining if STS and LTS are disconnected otherwise operating mode"]
[null,"-3. operating mode, LTS and STS connected"]
[]
["Rechargeable battery",{"$f":"settings!B37","v":"Yes"}]
["STS always connected to LTS",{"$f":"settings!B46","v":"No"},"STS/LTS unconnected",null,null,null,null,null,null,"STS/LTS connected"]
["VLDlsb",{"$f":"constants!C64","v":7.2999999999999995E-2},null,{"$f":"IF(B12=-1,B11,B13)","v":3.3579999999999997},1.25,null,null,null,null,null,{"$f":"B10","v":3.577},2]
[{"$f":"\"v_bat_max_hi (\"&TEXT(B10,\"0.00\")&\")\"","v":"v_bat_max_hi (3.58)"},{"$f":"(settings!H15+1)*'chart calc'!B9","v":3.577},null,{"$f":"B18","v":1.3},1,null,null,null,null,null,{"$f":"F76","v":3.1025},1]
[{"$f":"\"v_bat_max_lo (\"&TEXT(B11,\"0.00\")&\")\"","v":"v_bat_max_lo (3.36)"},{"$f":"(settings!H76+1)*B9","v":3.3579999999999997},"SLOPE1",{"$f":"SLOPE(D9:D10,E9:E10)","v":8.2319999999999993},null,null,null,null,null,"SLOPE1",{"$f":"SLOPE(K9:K10,L9:L10)","v":0.47449999999999992}]
[{"$f":"\"v_apl_max_hi (\"&TEXT(B12,\"0.00\")&\")\"","v":"v_apl_max_hi (-1.00)"},{"$f":"IF(settings!H43>settings!H42,-1,(settings!H43+1)*B9)","v":-1},"INTERCEPT1",{"$f":"INTERCEPT(D9:D10,E9:E10)","v":-6.9319999999999995},null,null,null,null,null,"INTERCEPT1",{"$f":"INTERCEPT(K9:K10,L9:L10)","v":2.6280000000000001}]
[{"$f":"\"v_apl_max_lo (\"&TEXT(B13,\"0.00\")&\")\"","v":"v_apl_max_lo (-1.00)"},{"$f":"IF(settings!H43>settings!H42,-1,(settings!H73+1)*B9)","v":-1},null,{"$f":"B16","v":2.847},1.5,null,{"$f":"(B16+G14)/2","v":1.7484999999999999},1.5,null,null,{"$f":"B11","v":3.3579999999999997},2.5]
[{"$f":"\"v_bat_min_hi_dis (\"&TEXT(B14,\"0.00\")&\")\"","v":"v_bat_min_hi_dis (2.85)"},{"$f":"(settings!H66+1)*B9","v":2.847},null,{"$f":"D9","v":3.3579999999999997},1.25,null,{"$f":"D201","v":0.65},1.25,null,null,{"$f":"K9","v":3.577},2]
[{"$f":"\"v_bat_min_hi_con (\"&TEXT(B15,\"0.00\")&\")\"","v":"v_bat_min_hi_con (2.85)"},{"$f":"(settings!H67+1)*B9","v":2.847},"SLOPE2",{"$f":"SLOPE(D13:D14,E13:E14)","v":-2.0439999999999987},null,null,{"$f":"SLOPE(G13:G14,H13:H14)","v":4.3940000000000001},null,null,"SLOPE2",{"$f":"SLOPE(K13:K14,L13:L14)","v":-0.43800000000000061}]
[{"$f":"\"v_bat_min_hi (\"&TEXT(B16,\"0.00\")&\")\"","v":"v_bat_min_hi (2.85)"},{"$f":"IF(B8=\"No\",B14,B15)","v":2.847},"INTERCEPT2",{"$f":"INTERCEPT(D13:D14,E13:E14)","v":5.9129999999999985},null,null,{"$f":"INTERCEPT(G13:G14,H13:H14)","v":-4.8425000000000002},null,null,"INTERCEPT2",{"$f":"INTERCEPT(K13:K14,L13:L14)","v":4.4530000000000012}]
[{"$f":"\"v_bat_min_lo (\"&TEXT(B17,\"0.00\")&\")\"","v":"v_bat_min_lo (2.77)"},{"$f":"(settings!H17+1)*B9","v":2.774},null,{"$f":"D14","v":3.3579999999999997},1.75,null,null,null,null,null,{"$f":"K14","v":3.577},3]
[{"$f":"\"Vcs_hi (\"&TEXT(B18,\"0.00\")&\")\"","v":"Vcs_hi (1.30)"},{"$f":"constants!B154","v":1.3},null,{"$f":"D13","v":2.847},1.5,null,null,null,null,null,{"$f":"K13","v":3.3579999999999997},2.5]
[null,null,"SLOPE3",{"$f":"SLOPE(D17:D18,E17:E18)","v":2.0439999999999987},null,null,null,null,null,"SLOPE3",{"$f":"SLOPE(K17:K18,L17:L18)","v":0.43800000000000061}]
["ULP LDO",{"$f":"settings!B93","v":2.6},"INTERCEPT3",{"$f":"INTERCEPT(D17:D18,E17:E18)","v":-0.21899999999999764},null,null,null,null,null,"INTERCEPT3",{"$f":"INTERCEPT(K17:K18,L17:L18)","v":2.2629999999999981}]
{"$rows_left_out":356}