{"text_format":"1","workbook":"xlsx","n_sheets":7,"sheets":["settings","register map","timing diagram","constants","messages","txt source","chart calc"],"not_rendered":{"charts":2,"images":4,"macros":1,"external_links":0,"defined_names":3,"comments":0,"pivot_tables":0},"unopened":[{"sheet":"timing diagram","index":2,"reason":"not_a_worksheet"}],"bounds":{"document_bytes":16777216,"sheet_cells":100000,"rows_first":2000,"rows_last":500,"rows_between":2000,"halvings":0,"cell_chars":16384,"cell_head_chars":4096},"cells_cut":0,"cells_raw":0,"read":"whole","date_system":"1900"}

{"sheet":"settings","index":0,"n_rows":156,"n_cols":11,"rows_kept":156,"cut":false,"hidden":false,"merged":[[7,0,7,10],[0,0,0,10],[1,4,1,5],[2,4,2,5],[3,4,4,5],[1,6,4,10],[2,1,2,3],[1,1,1,3],[3,1,3,3],[4,1,4,3],[5,1,5,10],[56,0,56,10],[62,0,62,10],[67,0,67,10],[34,0,34,10],[44,0,44,10],[40,0,40,10],[35,0,35,10],[39,0,39,10],[43,0,43,10],[27,0,27,10],[20,0,20,10],[15,0,15,10],[12,0,12,10],[8,0,8,10],[11,0,11,10],[26,0,26,10],[128,0,128,10],[123,0,123,10],[118,0,118,10],[107,0,107,10],[117,0,117,10],[127,0,127,10],[93,0,93,10],[76,0,76,10],[68,0,68,10],[63,0,63,10],[57,0,57,10],[81,0,81,10],[77,0,77,10],[74,0,74,10],[85,0,88,0],[85,5,88,5],[80,0,80,10],[73,0,73,10]]}
["EM8500 QUICK WIZARD"]
["Author","EM-Microelectronic SA",null,null,"User settings"]
["Date:","2025-08-29",null,null,"Calculation results"]
["Description:","EM8500 simplified configuration",null,null,{"$f":"IF(COUNTIF('register map'!F3:F28,\"\")<>26,messages!A65,IF(COUNTIF(F10:F156,\"ERROR*\")>0,messages!A42,IF(COUNTIF(F10:F156,\"WARNING*\")>0,messages!A67,messages!A79)))","v":"OK"}]
["Revision:",2.2000000000000002]
["Configuration description:"]
["Parameter","Value","Unit","Related Register Name","Value","Check","Note","DEC","WEIGHT",null,"User comments"]
["HARVESTER SETTINGS: refer to the chapter 2.2 of  \"App Note 85 Configuration\""]
["Harvester type: refer to the chapter 2.1 of e8500_app_note_hrv_param.pdf"]
["Harvester type","TEG","--",null,null,{"$f":"messages!A79","v":"OK"}]
["MPPT ratio",{"$f":"IF(B10=constants!B1,constants!H2,constants!B2)","v":0.5},"--","reg_mppt_ratio ",{"$f":"HLOOKUP(B11,constants!B2:N4,3,FALSE)","v":"0x00"},{"$f":"IF(B10=\"TEG\",IF(B11=0.5,messages!A79,messages!A51),IF(B10=\"Other\",messages!A79,IF(settings!B11<constants!G2,messages!A52,IF(settings!B11>constants!I2,messages!A52,messages!A79))))","v":"OK"}]
[]
["Harvester check settings: refer to the chapter 2.2 of e8500_app_note_hrv_param.pdf"]
["HRV check method",{"$f":"IF(B10=constants!B1,constants!C8,constants!B8)","v":"Open voltage"},"--","reg_v_hrv_cfg.hrv_check_vld",{"$f":"HLOOKUP(B14,constants!$B$8:$C$9,2,FALSE)","v":"'1'"},{"$f":"IF(AND(B14=constants!B8,settings!B10=constants!B1),messages!A54,IF(AND(settings!B14=constants!C8,settings!B10=constants!C1),messages!A53,messages!A79))","v":"OK"},"Open voltage is preferable for TEG ; Short cut current preferable for Solar cell",{"$f":"HLOOKUP(B14,constants!$B$8:$C$10,3,FALSE)","v":1},64]
["Maximum battery and application voltage:",3.6,"V","reg_v_bat_max_hi",{"$f":"IF((TRUNC(B15/constants!D64-1)+1)>9,\"0x\"&DEC2HEX(TRUNC(B15/constants!D64-1)+1),\"0x0\"&DEC2HEX(TRUNC(B15/constants!D64-1)+1))","v":"0x30"},{"$f":"IF(B15>constants!D67,messages!A14,messages!A79)","v":"OK"},null,{"$f":"(TRUNC(B15/constants!D64-1)+1)","v":48},1]
["Harvester check settings for a TEG: refer to the chapter 2.2.1 of e8500_app_note_hrv_param.pdf"]
["Minimum battery and application voltage:",2.7,"V","reg_v_bat_min_lo",{"$f":"IF(H17>9,\"0x\"&DEC2HEX(H17),\"0x0\"&DEC2HEX(H17))","v":"0x25"},{"$f":"IF(B17<constants!B68,messages!A17,IF(B15-B17<0.6,messages!A18,messages!A79))","v":"OK"},"Set the absolute minimum battery voltage",{"$f":"(TRUNC(B17/constants!B64-1)+1)","v":37},1]
[{"$f":"IF(B14=constants!C8,\"Unused\",\"HRV resistivity (Rteg)\")","v":"HRV resistivity (Rteg)"},120,"Ω",null,null,{"$f":"IF(AND(B14=constants!B8,B15<=2,B18>MAX(constants!B15:B18)),messages!A5,IF(AND(B14=constants!B8,settings!B15<=3,B15>2,settings!B18>MAX(constants!C15:C18)),messages!A4,IF(AND(B14=constants!B8,B15>3,settings!B18>MAX(constants!D15:D18)),messages!A3,IF(B14<>constants!B8,messages!A80,messages!A79))))","v":"OK"}]
["Minimum HRV open voltage",{"$f":"IF(B14<>constants!B8,messages!A80,IF(B10=constants!C1,IF(B15<=2,IF(B18<=constants!B15,constants!E15,IF(settings!B18<=constants!B16,constants!E16,IF(settings!B18<=constants!B17,constants!E17,IF(settings!B18<=constants!B18,constants!E18,constants!B19)))),IF(B15<=3,IF(B18<=constants!C15,constants!E15,IF(settings!B18<=constants!C16,constants!E16,IF(settings!B18<=constants!C17,constants!E17,IF(settings!B18<=constants!C18,constants!E18,constants!C19)))),IF(B18<=constants!D15,constants!E15,IF(settings!B18<=constants!D16,constants!E16,IF(settings!B18<=constants!D17,constants!E17,IF(settings!B18<=constants!D18,constants!E18,constants!D19)))))),messages!A80))","v":288},"mV","reg_v_hrv_cfg.v_hrv_min",{"$f":"IF(B19<>messages!A80,VLOOKUP(B19,constants!E15:F18,2,FALSE),\"0x01\")","v":"0x03"},null,"Below that level the EM8500 DCDC is deactivated",{"$f":"IF(B19<>messages!A80,VLOOKUP(B19,constants!E15:G18,3,FALSE),1)","v":3},1]
["Pin_min",{"$f":"IF(B19=messages!A80,messages!A80,IF(B19=constants!B19,constants!B19,1000000*(0.001*settings!B19)^2/(4*settings!B18)))","v":172.80000000000004},"uW",null,null,null,"Minimum power the EM8500 can harvest in such condition"]
["Harvester check settings for a Solar cell: refer to the chapter 2.2.2 of e8500_app_note_hrv_param.pdf"]
["Voc_min",0.5,"V",null,null,{"$f":"IF(B22>constants!D22,messages!A7,messages!A79)","v":"OK"},"Solar cell open voltage at minimum light conditions"]
["Vmpp_min",{"$f":"IF(B22<0.2,0.2,VLOOKUP(ROUND(B22*B11,1),constants!A27:A40,1,TRUE))","v":0.3},"V",null,null,{"$f":"IF(B14<>constants!C8,messages!A80,IF(B15<=2,IF(VLOOKUP(B23,constants!A27:B40,2,FALSE)=constants!B19,messages!A8,messages!A79),IF(B15<=3,IF(VLOOKUP(B23,constants!A27:C40,3,FALSE)=constants!B19,messages!A8,messages!A79),IF(VLOOKUP(B23,constants!A27:D40,4,FALSE)=constants!B19,messages!A8,messages!A79))))","v":"OK (Non applicable)"}]
["Ihrv_lim absolute min",{"$f":"IF(B14<>constants!C8,messages!A80,IF(settings!F23<>messages!A79,constants!B19,IF(settings!B15<=2,VLOOKUP(settings!B23,constants!A27:B40,2,FALSE),IF(settings!B15<=3,VLOOKUP(settings!B23,constants!A27:C40,3,FALSE),VLOOKUP(settings!B23,constants!A27:D40,4,FALSE)))))","v":"OK (Non applicable)"},"uA",null,null,null,"Below that level the EM8500 DCDC is deactivated"]
["Ihrv_lim effective",15,"uA","reg_hrv_check_lvl",{"$f":"IF(B14<>constants!C8,\"0x00\",IF(B25<B24,constants!B19,HLOOKUP(settings!B25,constants!B42:Q43,2,FALSE)))","v":"0x00"},{"$f":"IF(settings!B14<>constants!C8,messages!A80,IF(settings!B25<settings!B24,messages!A10,messages!A79))","v":"OK (Non applicable)"}]
["Pin_min",{"$f":"IF(B14<>constants!C8,messages!A80,IF(settings!F23<>messages!A79,constants!B19,settings!B25*settings!B23))","v":"OK (Non applicable)"},"uW"]
[]
["Harvester check timing settings: refer to the chapter 2.2.3 & 2.2.4 of e8500_app_note_hrv_param.pdf"]
["HRV capacitor (Chrv)",4.7,"uF",null,null,{"$f":"IF(OR(B29<constants!B46,B29>constants!D46),messages!A9,messages!A79)","v":"OK"}]
["Thrv_meas ideal",{"$f":"CEILING(IF(B10<>constants!B1,IF(B19=constants!B19,constants!B19,5*settings!B18*settings!B29/1000),IF(settings!B25=constants!B19,constants!B19,(2500*(settings!B23/settings!B11-settings!B23)*settings!B29)/settings!B25)),1)","v":3},"ms"]
["Thrv_meas effective",128,"ms","reg_t_hrv_meas",{"$f":"VLOOKUP(B31,constants!B51:D58,3,FALSE)","v":"0x03"},{"$f":"IF(B30>constants!B58,messages!A11,IF(B30>B31,messages!A12,messages!A79))","v":"OK"},{"$f":"\"Shall be closer and just higher than Thrv_meas_ideal: \"&IF(B30<=constants!B51,constants!B51,IF(B30<=constants!B52,constants!B52,IF(B30<=constants!B53,constants!B53,IF(B30<=constants!B54,constants!B54,IF(B30<=constants!B55,constants!B55,IF(B30<=constants!B56,constants!B56,IF(B30<=constants!B57,constants!B57,constants!B58)))))))&\" ms\"","v":"Shall be closer and just higher than Thrv_meas_ideal: 16 ms"}]
["Thrv_period",4096,"ms","reg_t_hrv_period",{"$f":"VLOOKUP(B32,constants!C51:D58,2,FALSE)","v":"0x04"},{"$f":"IF(B32<2*$B$31,messages!$A$13,IF(B32<16*$B$31,messages!$A$55,messages!$A$79))","v":"OK"}]
["Efficiency loss @ Pin_min due to HRV control",{"$f":"B31/B32","v":3.125E-2},"%"]
["Thrv_period in HRV LOW mode",256,"ms","reg_t_hrv_low_cfg.t_hrv_low_period ",{"$f":"VLOOKUP(B34,constants!C51:E58,3,FALSE)","v":"\"000\""},{"$f":"messages!A69&TRUNC(30000/(8*B34))/10&\" nW\"","v":"Note: the power consumption of the HRV supervisory & sampling in HRV LOW mode is: 1.4 nW"},null,{"$f":"VLOOKUP(B34,constants!C51:F58,4,FALSE)","v":0},16]
["STORAGE SUPERVISORY SETTINGS: refer to the chapter 5 of \"App Note 85 Storage\""]
["Operating mode selection: refer to the chapter 4 of e8500_app_note_store_supervise.pdf"]
["Rechargeable battery","Yes","--","reg_lts_cfg.prim_cell",{"$f":"IF(B37=constants!$B$60,\"'0'\",\"'1'\")","v":"'0'"},null,"Yes = rechargeable ; No = Non-rechargeable",{"$f":"IF(B37=constants!$B$60,0,1)","v":0},2]
["Under voltage protection","Yes","--","reg_lts_cfg.no_bat_protect",{"$f":"IF(B38=constants!$B$60,\"'0'\",\"'1'\")","v":"'0'"},{"$f":"IF(B38=constants!C60,messages!A57,messages!A79)","v":"OK"},"Set Yes if LTS shall be disconnected in under voltage condition to protect the battery",{"$f":"IF(B38=constants!$B$60,0,1)","v":0},1]
["LTS connected to STS at start-up (in prim_cell mode only)","No","--","reg_lts_cfg.prim_cell_connect",{"$f":"IF(B39=constants!$B$60,\"'1'\",\"'0'\")","v":"'0'"},null,"Set Yes if LTS shall be connected to STS at start-up or after a soft-reset",{"$f":"IF(B39=constants!$B$60,1,0)","v":0},4]
[]
["Absolute min/max selection: refer to the chapter 5 of e8500_app_note_store_supervise.pdf"]
["Maximum battery voltage v_bat_max_hi",{"$f":"B15","v":3.6},"V","reg_v_bat_max_hi",{"$f":"IF(H42>9,\"0x\"&DEC2HEX(H42),\"0x0\"&DEC2HEX(H42))","v":"0x30"},{"$f":"IF(B42<=B17+3*constants!C64,messages!A19,messages!A79)","v":"OK"},"Set the absolute maximum voltage the battery can afford",{"$f":"H15","v":48},1]
["Maximum application voltage:",4.2,"V","reg_v_apl_max_hi",{"$f":"IF(H43>9,\"0x\"&DEC2HEX(H43),\"0x0\"&DEC2HEX(H43))","v":"0x3F"},{"$f":"IF(AND(H43<>63,H43>=(H42-1)),messages!A35,IF(B43<=B17+3*constants!C64,messages!A15,IF(B43>constants!D67,messages!A16,messages!A79)))","v":"OK"},"Set the absolute maximum voltage the application can afford",{"$f":"IF(B43<B42,(TRUNC(B43/constants!D64-1)+1),63)","v":63},1]
[]
["Csts capacitor selection: refer to the chapter 6 of e8500_app_note_store_supervise.pdf"]
["STS always connected to LTS","No","--",null,null,{"$f":"IF(AND(B37=constants!C60,B46=constants!B60),messages!A56,messages!A79)","v":"OK"},"Set No in primary cell mode or if STS shall supply the application without any help from LTS in some condition"]
["Capacitor on VSUP (Csup)",1,"uF",null,null,{"$f":"IF(OR(B92=constants!B60,settings!H43<63),IF(B47<constants!B71,messages!A20,messages!$A$79),messages!A79)","v":"OK"},"Minimum capacity allowed is 1uF"]
["Capacitor on VAUX[0] (Caux0)",1,"uF",null,null,{"$f":"IF(OR(B101=constants!$B$124,AND(settings!B101=constants!$D$124,settings!$H$43=63),AND(B101=constants!$E$124,$H$43=63)),messages!$A$79,IF(B48<constants!B72,messages!A21,messages!$A$79))","v":"OK"},"Minimum capacity allowed is 1uF if VAUX[0] used"]
["Capacitor on VAUX[1] (Caux1)",1,"uF",null,null,{"$f":"IF(OR(B102=constants!$B$124,AND(settings!B102=constants!$D$124,settings!$H$43=63),AND(B102=constants!$E$124,$H$43=63)),messages!$A$79,IF(B49<constants!B73,messages!A22,messages!$A$79))","v":"OK"},"Minimum capacity allowed is 1uF if VAUX[1] used"]
["Capacitor on VAUX[2] (Caux2)",1,"uF",null,null,{"$f":"IF(OR(B103=constants!$B$124,AND(settings!B103=constants!$D$124,settings!$H$43=63),AND(B103=constants!$E$124,$H$43=63)),messages!$A$79,IF(B50<constants!B74,messages!A23,messages!$A$79))","v":"OK"},"Minimum capacity allowed is 1uF if VAUX[2] used"]
["Csup switched on with other cap","Yes","--",null,null,null,"Set \"Yes\" if Csup can be enabled together with others VAUX"]
["Caux0 switched on with other cap","No","--",null,null,null,"Set \"Yes\" if Caux0 can be enabled together with VSUP or others VAUX"]
["Caux1 switched on with other cap","No","--",null,null,null,"Set \"Yes\" if Caux1 can be enabled together with VSUP or others VAUX"]
["Caux2 switched on with other cap","No","--",null,null,null,"Set \"Yes\" if Caux2 can be enabled together with VSUP or others VAUX"]
["Minimum Csts allowed",10,"uF"]
["Capacitor on STS (Csts)",10,"uF",null,null,{"$f":"IF(B56<B55,messages!A24,messages!A79)","v":"OK"}]
[]
["STS survey period: refer to the chapter 7 of e8500_app_note_store_supervise.pdf"]
["Minimum input power: Pin_min",{"$f":"IF(B14=constants!B8,settings!B20,settings!B26)","v":172.80000000000004},"uW"]
["Maximum power loss @Pin_min in VLD allowed: VLDloss",0.2,"%"]
["Minimum Tsts_period",{"$f":"IF((0.000003/(4*(B59/1000000)*B60))<1,1,0.000003/(4*(B59/1000000)*B60))","v":1},"ms",null,null,{"$f":"IF(B61>constants!B85,messages!A26,messages!A79)","v":"OK"}]
["Effective Tsts_period",2,"ms","reg_t_sts_period",{"$f":"\"0x0\"&VLOOKUP(B62,constants!B78:D85,3,FALSE)","v":"0x01"},{"$f":"IF(B62<B61,messages!A27,messages!A79)","v":"OK"},{"$f":"\"Shall be closer and just higher than Thrv_meas_ideal: \"&IF(B61<=constants!B78,constants!B78,IF(B61<=constants!B79,constants!B79,IF(B61<=constants!B80,constants!B80,IF(B61<=constants!B81,constants!B81,IF(B61<=constants!B82,constants!B82,IF(B61<=constants!B83,constants!B83,IF(B61<=constants!B84,constants!B84,constants!B85)))))))&\" ms\"","v":"Shall be closer and just higher than Thrv_meas_ideal: 1 ms"}]
[]
["Hysteresis v_bat_min: refer to the chapter 8 of e8500_app_note_store_supervise.pdf"]
["Max avrg. consumption of apply when STS/LTS disconnected: Imax",0.1,"mA",null,null,null,"Maximum consumption of application when STS & LTS disconnected"]
["High level of v_bat_min: LTS/STS disconnected",{"$f":"IF(B46=constants!B60,(settings!H66+1)*constants!D64,2*(B62/1000)*(B65/1000)/(B56/1000000)+((TRUNC(B17/constants!B64-1)+1)+1)*constants!D64)","v":2.8694799999999998},"V","reg_v_bat_min_hi_dis",{"$f":"IF(H66>9,\"0x\"&DEC2HEX(H66),\"0x0\"&DEC2HEX(H66))","v":"0x26"},{"$f":"IF(AND(H66<H43,H66<H42),messages!A79,IF(B46=\"No\",messages!A28,messages!A79))","v":"OK"},null,{"$f":"IF(B46=constants!B60,settings!H67,(TRUNC(B66/constants!D64-1)+1))","v":38},1]
["High level of v_bat_min: LTS/STS connected",{"$f":"(H67+1)*constants!D64","v":2.90394},"V","reg_v_bat_min_hi_con",{"$f":"IF(H67>9,\"0x\"&DEC2HEX(H67),\"0x0\"&DEC2HEX(H67))","v":"0x26"},{"$f":"IF(H67<H43,messages!A79,messages!A30)","v":"OK"},null,{"$f":"H17+1","v":38},1]
[]
["Level v_apl_max_lo: refer to the chapter 9 of e8500_app_note_store_supervise.pdf"]
["Maximum Vmpp",0.5,"V",null,null,null,"Vmpp in best case condition (higher luminescence in case of solar cell for instance)"]
["Min LTS charge time",1,"ms",null,null,null,"Minimum delay to charge LTS at maximum application consumption",{"$f":"TRUNC(39*constants!D64/constants!D64-1)","v":38}]
["Maximum input power for charging STS",{"$f":"IF((6.65*B70^2)>10,10,6.65*B70^2)","v":1.6625000000000001},"mW",null,null,null,"Maximum input power when charging STS (cannot be higher than 10mW)"]
["Low level of v_apl_max_h",{"$f":"IF(H43=63,B43,IF(B46=constants!C60,IF(4*(B62/1000)*(B72/1000)/(B56/1000000)>B43^2,constants!B19,IF((B43-SQRT(B43^2-4*(B62/1000)*(B72/1000)/(B56/1000000)))>constants!D64,SQRT(B43^2-4*(B62/1000)*(B72/1000)/(B56/1000000)),H43*constants!D64)),(H73+1)*constants!B64))","v":4.2},"V","reg_v_apl_max_lo",{"$f":"IF(H73>15,\"0x\"&DEC2HEX(H73),\"0x0\"&DEC2HEX(H73))","v":"0x3E"},{"$f":"IF(OR(AND(H43<>63,H73<=H66),AND(H43<>63,H73<=H67)),messages!A29,IF(B73=constants!B19,messages!A31,IF(H43=63,messages!A79,IF(B46=constants!C60,IF(OR((H73+1)*constants!D64<((B71/1000)*(B65/1000)/(B56/1000000)+B66),H73>=H43),messages!A32,messages!A79),IF(H73<=H67,messages!A33,messages!A79)))))","v":"OK"},null,{"$f":"IF(H43=63,62,IF(B46=constants!C60,IF(B73=constants!B19,H43-1,IF((B43-SQRT(B43^2-4*(B62/1000)*(B72/1000)/(B56/1000000)))>constants!D64,(TRUNC(B73/constants!D64-1)+1),H43-1)),H43-1))","v":62},1]
[]
["Level v_bat_max_lo: refer to the chapter 10 of e8500_app_note_store_supervise.pdf"]
["Low level of v_bat_min",{"$f":"IF(H43=63,IF(B46=constants!C60,IF(4*(B62/1000)*(B72/1000)/(B56/1000000)>B42^2,constants!B19,IF((B42-SQRT(B42^2-4*(B62/1000)*(B72/1000)/(B56/1000000)))>constants!D64,SQRT(B42^2-4*(B62/1000)*(B72/1000)/(B56/1000000)),H42*constants!D64)),H42*constants!D64),H42*constants!D64)","v":3.4102785809959868},"V","reg_v_bat_max_lo",{"$f":"IF(B76=constants!B19,constants!B19,IF(H76>15,\"0x\"&DEC2HEX(H76),\"0x0\"&DEC2HEX(H76)))","v":"0x2D"},{"$f":"IF(AND(H76<=H43,H43<>63),messages!A36,IF(B76=constants!B19,messages!A34,IF(H43=63,IF(B46=constants!C60,IF(OR((H76+1)*constants!D64<((B71/1000)*(B65/1000)/(B56/1000000)+B66),H76>=H42),messages!A34,messages!A79),IF(H76<=H67,messages!A37,messages!A79)),IF(H76<=H67,messages!A37,messages!A79))))","v":"OK"},null,{"$f":"IF(B76=constants!B19,constants!B19,IF(H43=63,IF(B46=constants!C60,IF((B43-SQRT(B43^2-4*(B62/1000)*(B72/1000)/(B56/1000000)))>constants!D64,(TRUNC(B76/constants!D64-1)+1),H42-1),H42-1),H42-1))","v":45},1]
[]
["LTS survey period: refer to the chapter 11 of e8500_app_note_store_supervise.pdf"]
["Tlts_period",16,"ms","reg_t_lts_period",{"$f":"\"0x0\"&VLOOKUP(B79,constants!B88:D95,3,FALSE)","v":"0x02"},{"$f":"messages!A70&(TRUNC(100*3000/(4*B79),0))/100&\" nW\"","v":"Note: the power consumption of the VLD use to measure LTS is: 46.87 nW"}]
["Tlts_period in HRV LOW mode",32,"ms","reg_t_hrv_low_cfg.t_lts_hrv_low_period ",{"$f":"VLOOKUP(B80,constants!B98:D105,3,FALSE)","v":"\"010\""},{"$f":"messages!A71&(TRUNC(100*3000/(4*B80),0))/100&\" nW\"","v":"Note: the power consumption of the VLD use to measure LTS in HRV LOW mode is: 23.43 nW"},null,{"$f":"VLOOKUP(B80,constants!B98:E105,4,FALSE)","v":2},1]
["SUPPLY OUTPUTS VSUP, VAUX, VAUX_GND CONTROL: refer to \"App Note 85 Supply Outputs\""]
["VSUP settings: refer to the chapter 2 of e8500_app_note_supply_control.pdf"]
["VSUP grounded when disabled","Yes","--","reg_ldo_cfg.vsup_tied_low",{"$f":"IF(B83=constants!$B$60,\"'1'\",\"'0'\")","v":"'1'"},null,null,{"$f":"IF(B83=constants!$B$60,1,0)","v":1},128]
["VSUP in sleep mode at start-up","Yes","--","reg_pwr_mgt.sleep_vsup",{"$f":"IF(B84=constants!$B$60,\"'1'\",\"'0'\")","v":"'1'"},{"$f":"IF(AND($B$84=constants!$B$60,settings!$B$90=constants!$B$109),messages!$A$66,messages!$A$79)","v":"OK"},null,{"$f":"IF(B84=constants!$B$60,1,0)","v":1},1]
["VSUP disabled in HRV LOW mode","No","--","reg_pwr_cfg.dis_vsup_hrv_low",{"$f":"IF(B85=constants!$B$60,\"'1'\",\"'0'\")","v":"'0'"},{"$f":"IF(B85=constants!B60,messages!A59,messages!A79)","v":"OK"},null,{"$f":"IF(B85=constants!$B$60,1,0)","v":0},1]
["Sleep counter delay",0,"h",null,null,{"$f":"IF(H86>HEX2DEC(\"FFFFFF\"),messages!A38,IF(H86=0,messages!A39,messages!A79))","v":"OK"},null,{"$f":"B89+1000*B88+1000*60*B87+1000*60*60*B86","v":1000}]
[null,0,"min","reg_t_sleep_vsup_hi",{"$f":"IF($F$86=messages!$A$79,IF(H87>15,\"0x\"&DEC2HEX(H87),\"0x0\"&DEC2HEX(H87)),constants!$B$19)","v":"0x00"},null,null,{"$f":"TRUNC(H86/2^16)","v":0},1]
[null,1,"s","reg_t_sleep_vsup_mid",{"$f":"IF($F$86=messages!$A$79,IF(H88>15,\"0x\"&DEC2HEX(H88),\"0x0\"&DEC2HEX(H88)),constants!$B$19)","v":"0x03"},null,null,{"$f":"TRUNC((H86-H87*2^16)/(2^8))","v":3},1]
[null,0,"ms","reg_t_sleep_vsup_lo",{"$f":"IF($F$86=messages!$A$79,IF(H89>15,\"0x\"&DEC2HEX(H89),\"0x0\"&DEC2HEX(H89)),constants!$B$19)","v":"0xE8"},null,null,{"$f":"H86-H87*2^16-H88*2^8","v":232},1]
["Wake-up active edge selection","falling edge","--","reg_ext_cfg.wake_up_edge_cfg",{"$f":"HLOOKUP(B90,constants!B109:E110,2,FALSE)","v":"\"01\""},{"$f":"IF(AND($B$84=constants!$B$60,settings!$B$90=constants!$B$109),messages!$A$66,messages!$A$79)","v":"OK"},null,{"$f":"HLOOKUP(B90,constants!B109:E111,3,FALSE)","v":1},16]
["Wake-up debouncer enabled","Yes","--","reg_ext_cfg.wake_up_deb_en",{"$f":"IF(B91=constants!B60,\"'1'\",\"'0'\")","v":"'1'"},null,null,{"$f":"IF(B91=constants!B60,1,0)","v":1},64]
["VSUP always connected to ULP LDO","Yes","--","reg_ldo_cfg.frc_ulp_ldo",{"$f":"IF(B92=constants!B60,\"'1'\",\"'0'\")","v":"'1'"},null,null,{"$f":"IF(B92=constants!B60,1,0)","v":1},8]
["VSUP & VAUX LDO level",2.6,"V","reg_ldo_cfg.v_ulp_ldo\nreg_ldo_cfg.v_vaux_ldo",{"$f":"VLOOKUP(B93,constants!B114:C121,2,FALSE)","v":"\"111\""},{"$f":"IF(B93>=B15,messages!A60,messages!A79)","v":"OK"},null,{"$f":"VLOOKUP(B93,constants!B114:D121,3,FALSE)","v":7},1]
["VAUX settings: refer to the chapter 3 of e8500_app_note_supply_control.pdf"]
["VAUX[0] used","Yes","--"]
["VAUX[1] used","Yes","--"]
["VAUX[2] used","Yes","--"]
["VAUX[0] enabled at start-up","No","--","reg_pwr_mgt.vaux0_en",{"$f":"IF(B98=constants!$B$60,\"'1'\",\"'0'\")","v":"'0'"},{"$f":"IF(AND(B95=constants!$C$60,settings!B98=constants!$B$60),messages!$A$41,messages!$A$79)","v":"OK"},null,{"$f":"IF(B98=constants!$B$60,1,0)","v":0},2]
["VAUX[1] enabled at start-up","No","--","reg_pwr_mgt.vaux1_en",{"$f":"IF(B99=constants!$B$60,\"'1'\",\"'0'\")","v":"'0'"},{"$f":"IF(AND(B96=constants!$C$60,settings!B99=constants!$B$60),messages!$A$41,messages!$A$79)","v":"OK"},null,{"$f":"IF(B99=constants!$B$60,1,0)","v":0},4]
["VAUX[2] enabled at start-up","No","--","reg_pwr_mgt.vaux2_en",{"$f":"IF(B100=constants!$B$60,\"'1'\",\"'0'\")","v":"'0'"},{"$f":"IF(AND(B97=constants!$C$60,settings!B100=constants!$B$60),messages!$A$41,messages!$A$79)","v":"OK"},null,{"$f":"IF(B100=constants!$B$60,1,0)","v":0},8]
["VAUX[0] connection configuration","to VAUX LDO","--","reg_vaux_cfg.vaux0_cfg",{"$f":"HLOOKUP(B101,constants!$B$124:$E$125,2,FALSE)","v":"\"01\""},{"$f":"IF(B95=constants!C60,messages!A79,IF(AND(B101=constants!B124,settings!B92=constants!C60,settings!H43=63),messages!A79,IF(AND(B101=constants!$C$124,$B$92=constants!$B$60,$B$93=$B$104),messages!$A$79,IF(AND($B$92=constants!$C$60,OR(B101=constants!$D$124,B101=constants!$E$124)),messages!$A$79,messages!A61))))","v":"OK"},null,{"$f":"HLOOKUP(B101,constants!$B$124:$E$126,3,FALSE)","v":1},1]
["VAUX[1] connection configuration","to VAUX LDO","--","reg_vaux_cfg.vaux1_cfg",{"$f":"HLOOKUP(B102,constants!$B$124:$E$125,2,FALSE)","v":"\"01\""},{"$f":"IF(B96=constants!C60,messages!A79,IF(AND(B102=constants!B124,settings!B92=constants!C60,settings!H43=63),messages!A79,IF(AND(B102=constants!$C$124,$B$92=constants!$B$60,$B$93=$B$104),messages!$A$79,IF(AND($B$92=constants!$C$60,OR(B102=constants!$D$124,B102=constants!$E$124)),messages!$A$79,messages!A62))))","v":"OK"},null,{"$f":"HLOOKUP(B102,constants!$B$124:$E$126,3,FALSE)","v":1},4]
["VAUX[2] connection configuration","to VAUX LDO","--","reg_vaux_cfg.vaux2_cfg",{"$f":"HLOOKUP(B103,constants!$B$124:$E$125,2,FALSE)","v":"\"01\""},{"$f":"IF(B97=constants!C60,messages!A79,IF(AND(B103=constants!B124,settings!B92=constants!C60,settings!H43=63),messages!A79,IF(AND(B103=constants!$C$124,$B$92=constants!$B$60,$B$93=$B$104),messages!$A$79,IF(AND($B$92=constants!$C$60,OR(B103=constants!$D$124,B103=constants!$E$124)),messages!$A$79,messages!A63))))","v":"OK"},null,{"$f":"HLOOKUP(B103,constants!$B$124:$E$126,3,FALSE)","v":1},16]
["VAUX ldo level v_aux_ldo",{"$f":"B93","v":2.6},"V","reg_ldo_cfg.v_vaux_ldo",{"$f":"VLOOKUP(B104,constants!B129:C136,2,FALSE)","v":"\"111\""},{"$f":"IF(B104>=B15,messages!A60,messages!A79)","v":"OK"},null,{"$f":"VLOOKUP(B104,constants!B129:D136,3,FALSE)","v":7},16]
["Disable VAUX[0] in HRV LOW mode","No","--","reg_pwr_cfg.dis_vaux0_hrv_low",{"$f":"IF(B105=constants!$B$60,\"'1'\",\"'0'\")","v":"'0'"},null,null,{"$f":"IF(B105=constants!$B$60,1,0)","v":0},2]
["Disable VAUX[1] in HRV LOW mode","No","--","reg_pwr_cfg.dis_vaux1_hrv_low",{"$f":"IF(B106=constants!$B$60,\"'1'\",\"'0'\")","v":"'0'"},null,null,{"$f":"IF(B106=constants!$B$60,1,0)","v":0},4]
["Disable VAUX[2] in HRV LOW mode","No","--","reg_pwr_cfg.dis_vaux2_hrv_low",{"$f":"IF(B107=constants!$B$60,\"'1'\",\"'0'\")","v":"'0'"},null,null,{"$f":"IF(B107=constants!$B$60,1,0)","v":0},8]
["VAUX_GND settings: refer to the chapter 4 of e8500_app_note_supply_control.pdf"]
["VAUX_GND[0] enabled at start-up","No","--","reg_pwr_mgt.vaux_gnd0_en",{"$f":"IF(B109=constants!$B$60,\"'1'\",\"'0'\")","v":"'0'"},null,null,{"$f":"IF(B109=constants!$B$60,1,0)","v":0},16]
["VAUX_GND[1] enabled at start-up","No","--","reg_pwr_mgt.vaux_gnd1_en",{"$f":"IF(B110=constants!$B$60,\"'1'\",\"'0'\")","v":"'0'"},null,null,{"$f":"IF(B110=constants!$B$60,1,0)","v":0},32]
["VAUX_GND[2] enabled at start-up","No","--","reg_pwr_mgt.vaux_gnd2_en",{"$f":"IF(B111=constants!$B$60,\"'1'\",\"'0'\")","v":"'0'"},null,null,{"$f":"IF(B111=constants!$B$60,1,0)","v":0},64]
["VAUX_GND[0] connection configuration","whatever STS","--","reg_vaux_gnd_cfg.vaux0_cfg",{"$f":"HLOOKUP($B112,constants!$B$138:$C$139,2,FALSE)","v":"'0'"},null,"VAUX_GND[0] is disabled automatically when VDD_STS > v_apl_max_hi if option  \"Auto connect\" is selected",{"$f":"HLOOKUP($B112,constants!$B$138:$C$140,3,FALSE)","v":0},1]
["VAUX_GND[1] connection configuration","whatever STS","--","reg_vaux_gnd_cfg.vaux1_cfg",{"$f":"HLOOKUP($B113,constants!$B$138:$C$139,2,FALSE)","v":"'0'"},null,"VAUX_GND[1] is disabled automatically when VDD_STS > v_apl_max_hi if option  \"Auto connect\" is selected",{"$f":"HLOOKUP($B113,constants!$B$138:$C$140,3,FALSE)","v":0},2]
["VAUX_GND[2] connection configuration","whatever STS","--","reg_vaux_gnd_cfg.vaux2_cfg",{"$f":"HLOOKUP($B114,constants!$B$138:$C$139,2,FALSE)","v":"'0'"},null,"VAUX_GND[2] is disabled automatically when VDD_STS > v_apl_max_hi if option  \"Auto connect\" is selected",{"$f":"HLOOKUP($B114,constants!$B$138:$C$140,3,FALSE)","v":0},4]
["Disable VAUX_GND[0] in HRV LOW mode","No","--","reg_pwr_cfg.dis_vaux_gnd0_hrv_low",{"$f":"IF(B115=constants!$B$60,\"'1'\",\"'0'\")","v":"'0'"},null,null,{"$f":"IF(B115=constants!$B$60,1,0)","v":0},16]
["Disable VAUX_GND[1] in HRV LOW mode","No","--","reg_pwr_cfg.dis_vaux_gnd1_hrv_low",{"$f":"IF(B116=constants!$B$60,\"'1'\",\"'0'\")","v":"'0'"},null,null,{"$f":"IF(B116=constants!$B$60,1,0)","v":0},32]
["Disable VAUX_GND[2] in HRV LOW mode","No","--","reg_pwr_cfg.dis_vaux_gnd2_hrv_low",{"$f":"IF(B117=constants!$B$60,\"'1'\",\"'0'\")","v":"'0'"},null,null,{"$f":"IF(B117=constants!$B$60,1,0)","v":0},64]
["USB AND SERIAL INTERFACE SETTINGS"]
["USB configuration:"]
["USB LDO always disabled","No","--","reg_pwr_cfg.usb_ldo_frc_dis",{"$f":"IF(B120=constants!$B$60,\"'1'\",\"'0'\")","v":"'0'"},null,"Disable USB LDO in debug mode; VDD_USB does not support VDD_STS even if USB cable is connected",{"$f":"IF(B120=constants!$B$60,1,0)","v":0},128]
["USB forces HRV_LOW Hi-Z","No","--","reg_ext_cfg.usb_frc_hrv_low_hiz",{"$f":"IF(B121=constants!$B$60,\"'1'\",\"'0'\")","v":"'0'"},null,"HRV_LOW pin is Hi-Z when USB detected if Yes",{"$f":"IF(B121=constants!$B$60,1,0)","v":0},8]
["USB forces BAT_LOW Hi-Z","No","--","reg_ext_cfg.usb_frc_bat_low_hiz",{"$f":"IF(B122=constants!$B$60,\"'1'\",\"'0'\")","v":"'0'"},null,"BAT_LOW pin is Hi-Z when USB detected if Yes",{"$f":"IF(B122=constants!$B$60,1,0)","v":0},4]
["USB battery charger current source level",0,"mA","reg_ext_cfg.usb_crt_src_sel",{"$f":"HLOOKUP(B123,constants!B142:E143,2,FALSE)","v":"\"00\""},null,"USB current source disabled if 0mA selected",{"$f":"HLOOKUP(B123,constants!B142:E144,3,FALSE)","v":0},1]
["Serial interface settings:"]
["SDA slope control","Standard","--","reg_ext_cfg.sdi_slopectrl",{"$f":"IF($B125=constants!$B$147,\"'0'\",\"'1'\")","v":"'0'"},null,"Set Hi-speed only if I2C is used in Hi-speed mode and if VSUP is higher than 1.8V",{"$f":"IF($B125=constants!$B$147,0,1)","v":0},128]
["SPI configuration","4 wires","--","reg_spi_i2c_cfg.spi_3w_en",{"$f":"HLOOKUP(B126,constants!B148:C149,2,FALSE)","v":"'0'"},null,"If 3 wires is selected, input & output data share the same IO MOSI_SDA",{"$f":"HLOOKUP(B126,constants!B148:C150,3,FALSE)","v":0},128]
["I2C address",77,"hex","reg_spi_i2c_cfg.i2c_addr",{"$f":"IF(J127>127,constants!B19,IF(J127>15,\"0x\"&DEC2HEX(J127),\"0x0\"&DEC2HEX(J127)))","v":"0x77"},{"$f":"IF(HEX2DEC(B127)>127,messages!A40,messages!A79)","v":"OK"},null,{"$f":"IF(E127=constants!B19,0,HEX2DEC(settings!B127))","v":119},1,{"$f":"IF(C127=constants!$B$152,HEX2DEC(B127),IF(C127=constants!$C$152,HEX2DEC(DEC2HEX(B127)),BIN2DEC(B127)))","v":119}]
["FREE EEPROM AREA"]
["Free EEPROM area settings:"]
[126,"FF","hex","--",{"$f":"IF(J130>15,\"0x\"&DEC2HEX(J130),\"0x0\"&DEC2HEX(J130))","v":"0xFF"},null,"EEPROM area free for user",null,null,{"$f":"IF(C130=constants!$B$152,HEX2DEC(B130),IF(C130=constants!$C$152,HEX2DEC(DEC2HEX(B130)),BIN2DEC(B130)))","v":255}]
[{"$f":"A130+101","v":227},"FF","hex","--",{"$f":"IF(J131>15,\"0x\"&DEC2HEX(J131),\"0x0\"&DEC2HEX(J131))","v":"0xFF"},null,"EEPROM area free for user",null,null,{"$f":"IF(C131=constants!$B$152,HEX2DEC(B131),IF(C131=constants!$C$152,HEX2DEC(DEC2HEX(B131)),BIN2DEC(B131)))","v":255}]
[{"$f":"A131+101","v":328},"FF","hex","--","0xFF",null,"EEPROM area free for user",null,null,{"$f":"IF(C132=constants!$B$152,HEX2DEC(B132),IF(C132=constants!$C$152,HEX2DEC(DEC2HEX(B132)),BIN2DEC(B132)))","v":255}]
[429,"FF","hex","--","0xFF",null,"EEPROM area free for user",null,null,{"$f":"IF(C133=constants!$B$152,HEX2DEC(B133),IF(C133=constants!$C$152,HEX2DEC(DEC2HEX(B133)),BIN2DEC(B133)))","v":255}]
[530,"FF","hex","--","0xFF",null,"EEPROM area free for user",null,null,{"$f":"IF(C134=constants!$B$152,HEX2DEC(B134),IF(C134=constants!$C$152,HEX2DEC(DEC2HEX(B134)),BIN2DEC(B134)))","v":255}]
[631,"FF","hex","--","0xFF",null,"EEPROM area free for user",null,null,{"$f":"IF(C135=constants!$B$152,HEX2DEC(B135),IF(C135=constants!$C$152,HEX2DEC(DEC2HEX(B135)),BIN2DEC(B135)))","v":255}]
[732,"FF","hex","--","0xFF",null,"EEPROM area free for user",null,null,{"$f":"IF(C136=constants!$B$152,HEX2DEC(B136),IF(C136=constants!$C$152,HEX2DEC(DEC2HEX(B136)),BIN2DEC(B136)))","v":255}]
[833,"FF","hex","--","0xFF",null,"EEPROM area free for user",null,null,{"$f":"IF(C137=constants!$B$152,HEX2DEC(B137),IF(C137=constants!$C$152,HEX2DEC(DEC2HEX(B137)),BIN2DEC(B137)))","v":255}]
[934,"FF","hex","--","0xFF",null,"EEPROM area free for user",null,null,{"$f":"IF(C138=constants!$B$152,HEX2DEC(B138),IF(C138=constants!$C$152,HEX2DEC(DEC2HEX(B138)),BIN2DEC(B138)))","v":255}]
[1035,"FF","hex","--","0xFF",null,"EEPROM area free for user",null,null,{"$f":"IF(C139=constants!$B$152,HEX2DEC(B139),IF(C139=constants!$C$152,HEX2DEC(DEC2HEX(B139)),BIN2DEC(B139)))","v":255}]
[1136,"FF","hex","--","0xFF",null,"EEPROM area free for user",null,null,{"$f":"IF(C140=constants!$B$152,HEX2DEC(B140),IF(C140=constants!$C$152,HEX2DEC(DEC2HEX(B140)),BIN2DEC(B140)))","v":255}]
[1237,"FF","hex","--","0xFF",null,"EEPROM area free for user",null,null,{"$f":"IF(C141=constants!$B$152,HEX2DEC(B141),IF(C141=constants!$C$152,HEX2DEC(DEC2HEX(B141)),BIN2DEC(B141)))","v":255}]
[1338,"FF","hex","--","0xFF",null,"EEPROM area free for user",null,null,{"$f":"IF(C142=constants!$B$152,HEX2DEC(B142),IF(C142=constants!$C$152,HEX2DEC(DEC2HEX(B142)),BIN2DEC(B142)))","v":255}]
[1439,"FF","hex","--","0xFF",null,"EEPROM area free for user",null,null,{"$f":"IF(C143=constants!$B$152,HEX2DEC(B143),IF(C143=constants!$C$152,HEX2DEC(DEC2HEX(B143)),BIN2DEC(B143)))","v":255}]
[1540,"FF","hex","--","0xFF",null,"EEPROM area free for user",null,null,{"$f":"IF(C144=constants!$B$152,HEX2DEC(B144),IF(C144=constants!$C$152,HEX2DEC(DEC2HEX(B144)),BIN2DEC(B144)))","v":255}]
[1641,"FF","hex","--","0xFF",null,"EEPROM area free for user",null,null,{"$f":"IF(C145=constants!$B$152,HEX2DEC(B145),IF(C145=constants!$C$152,HEX2DEC(DEC2HEX(B145)),BIN2DEC(B145)))","v":255}]
[1742,"FF","hex","--","0xFF",null,"EEPROM area free for user",null,null,{"$f":"IF(C146=constants!$B$152,HEX2DEC(B146),IF(C146=constants!$C$152,HEX2DEC(DEC2HEX(B146)),BIN2DEC(B146)))","v":255}]
[1843,"FF","hex","--","0xFF",null,"EEPROM area free for user",null,null,{"$f":"IF(C147=constants!$B$152,HEX2DEC(B147),IF(C147=constants!$C$152,HEX2DEC(DEC2HEX(B147)),BIN2DEC(B147)))","v":255}]
[1944,"FF","hex","--","0xFF",null,"EEPROM area free for user",null,null,{"$f":"IF(C148=constants!$B$152,HEX2DEC(B148),IF(C148=constants!$C$152,HEX2DEC(DEC2HEX(B148)),BIN2DEC(B148)))","v":255}]
[2045,"FF","hex","--","0xFF",null,"EEPROM area free for user",null,null,{"$f":"IF(C149=constants!$B$152,HEX2DEC(B149),IF(C149=constants!$C$152,HEX2DEC(DEC2HEX(B149)),BIN2DEC(B149)))","v":255}]
[2146,"FF","hex","--","0xFF",null,"EEPROM area free for user",null,null,{"$f":"IF(C150=constants!$B$152,HEX2DEC(B150),IF(C150=constants!$C$152,HEX2DEC(DEC2HEX(B150)),BIN2DEC(B150)))","v":255}]
[2247,"FF","hex","--","0xFF",null,"EEPROM area free for user",null,null,{"$f":"IF(C151=constants!$B$152,HEX2DEC(B151),IF(C151=constants!$C$152,HEX2DEC(DEC2HEX(B151)),BIN2DEC(B151)))","v":255}]
[2348,"FF","hex","--","0xFF",null,"EEPROM area free for user",null,null,{"$f":"IF(C152=constants!$B$152,HEX2DEC(B152),IF(C152=constants!$C$152,HEX2DEC(DEC2HEX(B152)),BIN2DEC(B152)))","v":255}]
[2449,"FF","hex","--","0xFF",null,"EEPROM area free for user",null,null,{"$f":"IF(C153=constants!$B$152,HEX2DEC(B153),IF(C153=constants!$C$152,HEX2DEC(DEC2HEX(B153)),BIN2DEC(B153)))","v":255}]
[2550,"FF","hex","--","0xFF",null,"EEPROM area free for user",null,null,{"$f":"IF(C154=constants!$B$152,HEX2DEC(B154),IF(C154=constants!$C$152,HEX2DEC(DEC2HEX(B154)),BIN2DEC(B154)))","v":255}]
[2651,"FF","hex","--","0xFF",null,"EEPROM area free for user",null,null,{"$f":"IF(C155=constants!$B$152,HEX2DEC(B155),IF(C155=constants!$C$152,HEX2DEC(DEC2HEX(B155)),BIN2DEC(B155)))","v":255}]
[2752,"FF","hex","--","0xFF",null,"EEPROM area free for user",null,null,{"$f":"IF(C156=constants!$B$152,HEX2DEC(B156),IF(C156=constants!$C$152,HEX2DEC(DEC2HEX(B156)),BIN2DEC(B156)))","v":255}]

{"sheet":"register map","index":1,"n_rows":67,"n_cols":16,"rows_kept":67,"cut":false,"hidden":false,"merged":[[56,8,56,10],[57,8,57,10],[63,8,63,10],[64,8,64,10],[65,8,65,10],[58,8,58,10],[59,8,59,10],[60,8,60,10],[61,8,61,10],[62,8,62,10],[51,8,51,10],[52,8,52,10],[53,8,53,10],[54,8,54,10],[55,8,55,10],[49,8,49,10],[50,8,50,10],[31,8,31,10],[32,8,32,10],[25,9,25,10],[26,8,26,10],[40,8,40,10],[46,8,46,10],[47,8,47,10],[41,8,41,10],[42,8,42,10],[43,8,43,10],[44,8,44,10],[48,8,48,10],[29,8,29,10],[30,8,30,10],[45,8,45,10],[16,9,16,10],[37,8,37,10],[38,8,38,10],[39,8,39,10],[33,8,33,10],[34,8,34,10],[35,8,35,10],[36,8,36,10],[28,8,28,10],[21,8,21,10],[24,8,24,10],[23,8,23,10],[22,8,22,10],[27,8,27,10],[20,8,20,10],[11,8,11,10],[10,8,10,10],[6,9,6,10],[5,8,5,10],[8,8,8,9],[13,8,13,10],[12,8,12,10],[14,8,14,10],[15,8,15,10],[17,8,19,10],[4,8,4,10],[3,8,3,10],[9,8,9,10],[7,8,7,10],[0,0,0,6],[1,8,1,10],[2,8,2,10],[0,8,0,9]]}
["EM8500 register map",null,null,null,null,null,null,null,{"$f":"IF(L10<=L11,messages!A44,IF(L15<=L16,messages!A45,IF(OR(L12<=L14,L13<=L14),messages!A46,IF(OR(L12>=L16,L13>=L16),messages!A47,IF(OR(L12>=L11,L13>=L11),messages!A48,IF(MID(H22,3,2)=\"00\",messages!A49,IF(COUNTIF(F3:F28,\"\")<>26,messages!A65,settings!E4)))))))","v":"OK"}]
["Register name in EEPROM area","Address","Related register","Calc Value [hex]","DEC","Overwrite\n[hex]","Effective\n[hex]",null,"Physical representation"]
["eeprom0","0x40","reg_t_hrv_period",{"$f":"settings!E32","v":"0x04"},null,null,{"$f":"IF(F3=\"\",D3,IF(HEX2DEC(F3)<16,\"0x0\"&F3,\"0x\"&F3))","v":"0x04"},{"$f":"TEXT(HEX2BIN(MID(G3,3,2)),\"00000000\")","v":"00000100"},{"$f":"VLOOKUP(VALUE(MID(H3,6,3)),constants!A51:C58,3,FALSE)&\" ms\"","v":"4096 ms"}]
["eeprom1","0x41","reg_t_hrv_meas",{"$f":"settings!E31","v":"0x03"},null,null,"0x03",{"$f":"TEXT(HEX2BIN(MID(G4,3,2)),\"00000000\")","v":"00000011"},{"$f":"VLOOKUP(VALUE(MID(H4,6,3)),constants!A51:B58,2,FALSE)&\" ms\"","v":"128 ms"}]
["eeprom2","0x42","reg_t_sts_period",{"$f":"settings!E62","v":"0x01"},null,null,"0x01","00000001",{"$f":"VLOOKUP(BIN2DEC(MID(H5,6,3)),constants!A78:B85,2,FALSE)&\" ms\"","v":"2 ms"}]
["eeprom3","0x43","reg_t_lts_period",{"$f":"settings!E79","v":"0x02"},null,null,"0x02","00000010",{"$f":"VLOOKUP(BIN2DEC(MID(H6,6,3)),constants!A88:B95,2,FALSE)&\" ms\"","v":"16 ms"}]
["eeprom4","0x44","reg_v_hrv_cfg",{"$f":"IF(E7>15,\"0x\"&DEC2HEX(E7),\"0x0\"&DEC2HEX(E7))","v":"0x43"},{"$f":"(PRODUCT(settings!H14:I14)+PRODUCT(settings!H19:I19))","v":67},null,"0x43","01000011",{"$f":"IF(MID(H7,2,1)=\"1\",constants!B186,constants!B185)","v":"HRV check by Vopen-voltage"},{"$f":"\"v_hrv_min: \"&TEXT((BIN2DEC(MID(H7,3,6))+1)*constants!C64,\"0.000\")&\" V (TYP)\"","v":"v_hrv_min: 0.292 V (TYP)"}]
["eeprom5","0x45","reg_hrv_check_lvl",{"$f":"settings!E25","v":"0x00"},null,null,"0x00","00000000",{"$f":"(BIN2DEC(MID(H8,5,4))+1)&\" µA\"","v":"1 µA"}]
["eeprom6","0x46","reg_lts_cfg",{"$f":"IF(E9>15,\"0x\"&DEC2HEX(E9),\"0x0\"&DEC2HEX(E9))","v":"0x00"},{"$f":"PRODUCT(settings!H37:I37)+PRODUCT(settings!H38:I38)+PRODUCT(settings!H39:I39)","v":0},null,"0x00","00000000",{"$f":"IF(MID(H9,7,1)=\"0\",constants!C190,IF(MID(H9,6,1)=\"0\",constants!C191&\" & \"&constants!B190,constants!C191&\" & \"&constants!B191))","v":"rechargeable battery"},null,{"$f":"IF(MID(H9,8,1)=\"0\",constants!D190,constants!D191)","v":"battery protection on"}]
["eeprom7","0x47","reg_v_bat_max_hi",{"$f":"settings!E42","v":"0x30"},null,null,"0x30","00110000",{"$f":"TEXT((BIN2DEC(MID(H10,3,6))+1)*constants!$C$64,\"0.000\")&\" V (TYP)\"","v":"3.577 V (TYP)"},null,null,{"$f":"BIN2DEC(H10)","v":48}]
["eeprom8","0x48","reg_v_bat_max_lo",{"$f":"settings!E76","v":"0x2D"},null,null,"0x2D","00101101",{"$f":"TEXT((BIN2DEC(MID(H11,3,6))+1)*constants!$C$64,\"0.000\")&\" V (TYP)\"","v":"3.358 V (TYP)"},null,null,45]
["eeprom9","0x49","reg_v_bat_min_hi_dis",{"$f":"settings!E66","v":"0x26"},null,null,"0x26","00100110",{"$f":"TEXT((BIN2DEC(MID(H12,3,6))+1)*constants!$C$64,\"0.000\")&\" V (TYP)\"","v":"2.847 V (TYP)"},null,null,38]
["eeprom10","0x4A","reg_v_bat_min_hi_con",{"$f":"settings!E67","v":"0x26"},null,null,"0x26","00100110",{"$f":"TEXT((BIN2DEC(MID(H13,3,6))+1)*constants!$C$64,\"0.000\")&\" V (TYP)\"","v":"2.847 V (TYP)"},null,null,38]
["eeprom11","0x4B","reg_v_bat_min_lo",{"$f":"settings!E17","v":"0x25"},null,null,"0x25","00100101",{"$f":"TEXT((BIN2DEC(MID(H14,3,6))+1)*constants!$C$64,\"0.000\")&\" V (TYP)\"","v":"2.774 V (TYP)"},null,null,37]
["eeprom12","0x4C","reg_v_apl_max_hi",{"$f":"settings!E43","v":"0x3F"},null,null,"0x3F","00111111",{"$f":"TEXT((BIN2DEC(MID(H15,3,6))+1)*constants!$C$64,\"0.000\")&\" V (TYP)\"","v":"4.672 V (TYP)"},null,null,63]
["eeprom13","0x4D","reg_v_apl_max_lo",{"$f":"settings!E73","v":"0x3E"},null,null,"0x3E","00111110",{"$f":"TEXT((BIN2DEC(MID(H16,3,6))+1)*constants!$C$64,\"0.000\")&\" V (TYP)\"","v":"4.599 V (TYP)"},null,null,62]
["eeprom14","0x4E","reg_ldo_cfg",{"$f":"IF(E17>15,\"0x\"&DEC2HEX(E17),\"0x0\"&DEC2HEX(E17))","v":"0xFF"},{"$f":"PRODUCT(settings!H83:I83)+PRODUCT(settings!H92:I92)+PRODUCT(settings!H93:I93)+PRODUCT(settings!H104:I104)","v":255},null,"0xFF","11111111",{"$f":"\"VAUX LDO: \"&VLOOKUP(VALUE(MID($H$17,2,3)),constants!$A$129:$B$136,2,FALSE)&\" V\"","v":"VAUX LDO: 2.6 V"},{"$f":"\"ULP LDO: \"&VLOOKUP(VALUE(MID($H$17,6,3)),constants!$A$114:$B$121,2,FALSE)&\" V\"","v":"ULP LDO: 2.6 V"}]
["eeprom15","0x4F","reg_pwr_cfg",{"$f":"IF(E18>15,\"0x\"&DEC2HEX(E18),\"0x0\"&DEC2HEX(E18))","v":"0x00"},{"$f":"PRODUCT(settings!H85:I85)+PRODUCT(settings!H105:I105)+PRODUCT(settings!H106:I106)+PRODUCT(settings!H107:I107)+PRODUCT(settings!H115:I115)+PRODUCT(settings!H116:I116)+PRODUCT(settings!H117:I117)+PRODUCT(settings!H120:I120)","v":0},null,"0x00","00000000"]
["eeprom16","0x50","reg_vaux_cfg",{"$f":"IF(E19>15,\"0x\"&DEC2HEX(E19),\"0x0\"&DEC2HEX(E19))","v":"0x15"},{"$f":"PRODUCT(settings!H101:I101)+PRODUCT(settings!H102:I102)+PRODUCT(settings!H103:I103)","v":21},null,"0x15","00010101"]
["eeprom17","0x51","reg_vaux_gnd_cfg",{"$f":"IF(E20>15,\"0x\"&DEC2HEX(E20),\"0x0\"&DEC2HEX(E20))","v":"0x00"},{"$f":"PRODUCT(settings!H112:I112)+PRODUCT(settings!H113:I113)+PRODUCT(settings!H114:I114)","v":0},null,"0x00","00000000"]
["eeprom18","0x52","reg_mppt_ratio",{"$f":"settings!E11","v":"0x00"},null,null,"0x00","00000000",{"$f":"TEXT(HLOOKUP(VALUE(MID(H21,5,4)),constants!B5:Q6,2,FALSE),\"0%\")","v":"50%"}]
["eeprom19","0x53","reg_ext_cfg",{"$f":"IF(E22>15,\"0x\"&DEC2HEX(E22),\"0x0\"&DEC2HEX(E22))","v":"0x50"},{"$f":"PRODUCT(settings!H90:I90)+PRODUCT(settings!H91:I91)+PRODUCT(settings!H121:I121)+PRODUCT(settings!H122:I122)+PRODUCT(settings!H123:I123)+PRODUCT(settings!H125:I125)","v":80},null,"0x50","01010000",{"$f":"VLOOKUP(MID($H22,N$67+2,2),constants!A172:B175,2,FALSE)","v":"USB crt source 0 mA"}]
["eeprom20","0x54","reg_t_sleep_vsup_lo",{"$f":"settings!E89","v":"0xE8"},null,null,"0xE8",null,"Sleep delay"]
["eeprom21","0x55","reg_t_sleep_vsup_mid",{"$f":"settings!E88","v":"0x03"},null,null,"0x03",null,"h:min:sec:ms"]
["eeprom22","0x56","reg_t_sleep_vsup_hi",{"$f":"settings!E87","v":"0x00"},null,null,"0x00",null,{"$f":"L25&\":\"&M25&\":\"&N25&\":\"&O25","v":"0:0:1:0"},null,null,{"$f":"TRUNC((HEX2DEC(MID(G25,3,2))*256*256+HEX2DEC(MID(G24,3,2))*256+HEX2DEC(MID(G23,3,2)))/(1000*60*60),0)","v":0},{"$f":"TRUNC((HEX2DEC(MID(G25,3,2))*256*256+HEX2DEC(MID(G24,3,2))*256+HEX2DEC(MID(G23,3,2)))/(1000*60)-L25*60,0)","v":0},{"$f":"TRUNC((HEX2DEC(MID(G25,3,2))*256*256+HEX2DEC(MID(G24,3,2))*256+HEX2DEC(MID(G23,3,2)))/(1000)-L25*3600-M25*60,0)","v":1},{"$f":"(HEX2DEC(MID(G25,3,2))*256*256+HEX2DEC(MID(G24,3,2))*256+HEX2DEC(MID(G23,3,2)))-N25*1000-M25*1000*60-L25*1000*60*60","v":0}]
["eeprom23","0x57","reg_t_hrv_low_cfg",{"$f":"IF(E26>15,\"0x\"&DEC2HEX(E26),\"0x0\"&DEC2HEX(E26))","v":"0x02"},{"$f":"PRODUCT(settings!H80:I80)+PRODUCT(settings!H34:I34)","v":2},null,"0x02","00000010",{"$f":"\"t_hrv_low_period: \"&VLOOKUP(VALUE(MID(H26,2,3)),constants!A51:C58,3,FALSE)&\" ms\"","v":"t_hrv_low_period: 256 ms"},{"$f":"\"t_lts_hrv_low_period: \"&VLOOKUP(BIN2DEC(MID(H26,6,3)),constants!A98:B105,2,FALSE)&\" ms\"","v":"t_lts_hrv_low_period: 32 ms"}]
["eeprom24","0x58","reg_spi_i2c_cfg",{"$f":"IF(E27>15,\"0x\"&DEC2HEX(E27),\"0x0\"&DEC2HEX(E27))","v":"0x77"},{"$f":"PRODUCT(settings!H126:I126)+PRODUCT(settings!H127:I127)","v":119},null,"0x77","01110111",{"$f":"\"I2C address: \"&BIN2HEX(MID(H27,2,7))","v":"I2C address: 77"}]
["eeprom25","0x59","reg_pwr_mgt",{"$f":"IF(E28>15,\"0x\"&DEC2HEX(E28),\"0x0\"&DEC2HEX(E28))","v":"0x01"},{"$f":"PRODUCT(settings!H84:I84)+PRODUCT(settings!H98:I98)+PRODUCT(settings!H99:I99)+PRODUCT(settings!H100:I100)+PRODUCT(settings!H109:I109)+PRODUCT(settings!H110:I110)+PRODUCT(settings!H111:I111)","v":1},null,"0x01","00000001"]
["eeprom26","0x5A",1,{"$f":"settings!E130","v":"0xFF"},null,null,{"$f":"IF(F29=\"\",D29,\"0x\"&F29)","v":"0xFF"}]
["eeprom27","0x5B",{"$f":"C29+1","v":2},{"$f":"settings!E131","v":"0xFF"},null,null,{"$f":"D30","v":"0xFF"}]
["eeprom28","0x5C",{"$f":"C30+1","v":3},{"$f":"settings!E132","v":"0xFF"},null,null,"0xFF"]
["eeprom29","0x5D",4,{"$f":"settings!E133","v":"0xFF"},null,null,"0xFF"]
["eeprom30","0x5E",5,{"$f":"settings!E134","v":"0xFF"},null,null,"0xFF"]
["eeprom31","0x5F",6,{"$f":"settings!E135","v":"0xFF"},null,null,"0xFF"]
["eeprom32","0x60",7,{"$f":"settings!E136","v":"0xFF"},null,null,"0xFF"]
["eeprom33","0x61",8,{"$f":"settings!E137","v":"0xFF"},null,null,"0xFF"]
["eeprom34","0x62",9,{"$f":"settings!E138","v":"0xFF"},null,null,"0xFF"]
["eeprom35","0x63",10,{"$f":"settings!E139","v":"0xFF"},null,null,"0xFF"]
["eeprom36","0x64",11,{"$f":"settings!E140","v":"0xFF"},null,null,"0xFF"]
["eeprom37","0x65",12,{"$f":"settings!E141","v":"0xFF"},null,null,"0xFF"]
["eeprom38","0x66",13,{"$f":"settings!E142","v":"0xFF"},null,null,"0xFF"]
["eeprom39","0x67",14,{"$f":"settings!E143","v":"0xFF"},null,null,"0xFF"]
["eeprom40","0x68",15,{"$f":"settings!E144","v":"0xFF"},null,null,"0xFF"]
["eeprom41","0x69",16,{"$f":"settings!E145","v":"0xFF"},null,null,"0xFF"]
["eeprom42","0x6A",17,{"$f":"settings!E146","v":"0xFF"},null,null,"0xFF"]
["eeprom43","0x6B",18,{"$f":"settings!E147","v":"0xFF"},null,null,"0xFF"]
["eeprom44","0x6C",19,{"$f":"settings!E148","v":"0xFF"},null,null,"0xFF"]
["eeprom45","0x6D",20,{"$f":"settings!E149","v":"0xFF"},null,null,"0xFF"]
["eeprom46","0x6E",21,{"$f":"settings!E150","v":"0xFF"},null,null,"0xFF"]
["eeprom47","0x6F",22,{"$f":"settings!E151","v":"0xFF"},null,null,"0xFF"]
["eeprom48","0x70",23,{"$f":"settings!E152","v":"0xFF"},null,null,"0xFF"]
["eeprom49","0x71",24,{"$f":"settings!E153","v":"0xFF"},null,null,"0xFF"]
["eeprom50","0x72",25,{"$f":"settings!E154","v":"0xFF"},null,null,"0xFF"]
["eeprom51","0x73",26,{"$f":"settings!E155","v":"0xFF"},null,null,"0xFF"]
["eeprom52","0x74",27,{"$f":"settings!E156","v":"0xFF"},null,null,"0xFF"]
["eeprom53","0x75","reserved","X",null,null,"X"]
["eeprom54","0x76","reserved","X",null,null,"X"]
["eeprom55","0x77","reserved","X",null,null,"X"]
["eeprom56","0x78","reserved","X",null,null,"X"]
["eeprom57","0x79","reserved","X",null,null,"X"]
["eeprom58","0x7A","reserved","X",null,null,"X"]
["eeprom59","0x7B","reserved","X",null,null,"X"]
["eeprom60","0x7C","reserved","X",null,null,"X"]
["eeprom61","0x7D","reserved","X",null,null,"X"]
["eeprom62","0x7E","reserved","X",null,null,"X"]
["eeprom63","0x7F","reserved","X",null,null,"X"]
[null,null,null,null,null,null,null,null,0,1,2,3,4,5,6,7]

{"sheet":"constants","index":3,"n_rows":196,"n_cols":17,"rows_kept":196,"cut":false,"hidden":true,"merged":[[11,1,11,3],[23,4,23,6],[47,0,49,0],[48,1,49,1],[47,3,49,3],[47,4,49,4],[47,5,49,5],[23,1,23,3]]}
["Harvester type","Solar cell","TEG"]
["MPPT ratio",{"$f":"2/4","v":0.5},{"$f":"3/5","v":0.6},{"$f":"4/6","v":0.66666666666666663},{"$f":"5/7","v":0.7142857142857143},{"$f":"6/8","v":0.75},{"$f":"7/9","v":0.77777777777777779},{"$f":"8/10","v":0.8},{"$f":"9/11","v":0.81818181818181823},{"$f":"10/12","v":0.83333333333333337},{"$f":"11/13","v":0.84615384615384615},{"$f":"12/14","v":0.8571428571428571},{"$f":"13/15","v":0.8666666666666667},{"$f":"14/16","v":0.875},{"$f":"14/16","v":0.875},{"$f":"14/16","v":0.875},{"$f":"14/16","v":0.875}]
["reg_mppt_ratio [dec]",0,{"$f":"B3+1","v":1},{"$f":"C3+1","v":2},3,4,5,6,7,8,9,10,11,12,13,14,15]
["reg_mppt_ratio [hex]",{"$f":"\"0x0\"&DEC2HEX(B3)","v":"0x00"},{"$f":"\"0x0\"&DEC2HEX(C3)","v":"0x01"},"0x02","0x03","0x04","0x05","0x06","0x07","0x08","0x09","0x0A","0x0B","0x0C",{"$f":"\"0x0\"&DEC2HEX(O3)","v":"0x0D"},"0x0E","0x0F"]
[null,0,1,10,11,100,101,110,111,1000,1001,1010,1011,1100,1101,1110,1111]
[null,0.5,0.6,0.66666666666666663,0.7142857142857143,0.75,0.77777777777777779,0.8,0.81818181818181823,0.83333333333333337,0.84615384615384615,0.8571428571428571,0.8666666666666667,0.875,0.875,0.875,0.875]
[]
["HRV check method","Open voltage","Short-cut current"]
["reg_v_hrv_cfg.hrv_check_vld","'1'","'0'"]
[null,1,0]
[]
[null,"Maximum TEG internal resistivity"]
[null,"Vout range","Vout range","Vout range"]
["Vov min","1.5V to 2V","2V to 3V","3V to 3.6V","Vov min","v_hrv_min","v_hrv_min"]
[216,830,410,80,{"$f":"A15","v":216},"0x02",2]
[288,2980,1490,290,{"$f":"A16","v":288},"0x03",3]
[359,5000,5000,1160,{"$f":"A17","v":359},"0x04",4]
[431,5000,5000,3350,{"$f":"A18","v":431},"0x05",5]
[null,"Out of range","Out of range","Out of range"]
[]
[null,"MIN","TYP","MAX"]
["VDD_HRV open",0.2,0.5,1.8]
[]
[null,"Ihrv_lim",null,null,"reg_hrv_check_lvl"]
[null,"Vout range","Vout range","Vout range","Vout range","Vout range","Vout range"]
[null,"1.5V to 2V","2V to 3V","3V to 3.6V","1.5V to 2V","2V to 3V","3V to 3.6V"]
[0.2,11,"Out of range","Out of range","0x0A","Out of range","Out of range"]
[0.3,4,8,15,"0x03","0x07","0x0E"]
[0.4,3,6,9,"0x02","0x05","0x08"]
[0.5,3,3,5,"0x02","0x02","0x04"]
[0.6,2,2,4,"0x01","0x01","0x03"]
[0.7,2,2,4,"0x01","0x01","0x03"]
[0.8,2,2,3,"0x01","0x01","0x02"]
[0.9,2,2,3,"0x01","0x01","0x02"]
[1,2,2,3,"0x01","0x01","0x02"]
[1.1000000000000001,1,1,2,"0x00","0x00","0x01"]
[1.2,1,1,2,"0x00","0x00","0x01"]
[1.3,1,1,2,"0x00","0x00","0x01"]
[1.4,1,1,2,"0x00","0x00","0x01"]
[1.45,1,1,2,"0x00","0x00","0x01"]
[]
["Ihrv_lim [uA]",1,{"$f":"B42+1","v":2},{"$f":"C42+1","v":3},4,5,6,7,8,9,10,11,12,13,14,15,16]
["reg_hrv_check_lvl",{"$f":"\"0x0\"&DEC2HEX(B42-1)","v":"0x00"},{"$f":"\"0x0\"&DEC2HEX(C42-1)","v":"0x01"},"0x02","0x03","0x04","0x05","0x06","0x07","0x08","0x09","0x0A","0x0B","0x0C","0x0D","0x0E","0x0F"]
[]
[null,"MIN","TYP","MAX"]
["Chrv",4.7,10,10,"uF"]
[]
["Register value","Thrv_meas","Thrv_period","Register value","Register value","Register value"]
[null,"(register : t_hrv_meas)","(register : t_hrv_period ; HRV_LOW = 0)"]
[null,null,"(register : t_hrv_low_period ; HRV_LOW = 1)"]
[0,16,256,"0x00","\"000\"",0]
[1,{"$f":"B51*2","v":32},512,"0x01","\"001\"",{"$f":"F51+1","v":1}]
[10,64,1024,"0x02","\"010\"",{"$f":"F52+1","v":2}]
[11,128,2048,"0x03","\"011\"",3]
[100,256,4096,"0x04","\"100\"",4]
[101,512,8192,"0x05","\"101\"",5]
[110,1024,16384,"0x06","\"110\"",6]
[111,2048,32768,"0x07","\"111\"",7]
[]
["Binary selection","Yes","No"]
[]
["VLD constants"]
[null,"MIN","TYP","MAX"]
["Vlvl",{"$f":"C64*0.98","v":7.1539999999999992E-2},7.2999999999999995E-2,{"$f":"C64*1.02","v":7.4459999999999998E-2},"V"]
[]
["Supervisory constants"]
["v_bat_max_hi",null,null,4.2,"V"]
["v_bat_min_lo",1.47,null,null,"V"]
[]
[null,"MIN","TYP","MAX"]
["Csup",1,null,null,"uF"]
["Caux0",1,null,null,"uF"]
["Caux1",1,null,null,"uF"]
["Caux2",1,null,null,"uF"]
["Csts",10,null,null,"uF"]
[]
["STS Supervisory timings"]
[0,1,"ms",0,0]
[1,2,"ms",{"$f":"D78+1","v":1},{"$f":"E78+1","v":1}]
[2,8,"ms",{"$f":"D79+1","v":2},2]
[3,16,"ms",3,3]
[4,32,"ms",4,4]
[5,64,"ms",5,5]
[6,128,"ms",6,6]
[7,256,"ms",7,7]
[]
["LTS Supervisory timings"]
[0,1,"ms",0,0]
[1,4,"ms",{"$f":"D88+1","v":1},{"$f":"E88+1","v":1}]
[2,16,"ms",{"$f":"D89+1","v":2},2]
[3,64,"ms",3,3]
[4,256,"ms",4,4]
[5,1024,"ms",5,5]
[6,4096,"ms",6,6]
[7,16384,"ms",7,7]
[]
["LTS Supervisory timings"]
[0,2,"ms","\"000\"",0]
[1,8,"ms","\"001\"",{"$f":"E98+1","v":1}]
[2,32,"ms","\"010\"",{"$f":"E99+1","v":2}]
[3,128,"ms","\"011\"",3]
[4,512,"ms","\"100\"",4]
[5,2048,"ms","\"101\"",5]
[6,8192,"ms","\"110\"",6]
[7,32768,"ms","\"111\"",7]
[]
["Tsleep unit","ms","s","min","h"]
[]
["Wake-up edge selection","no edge","falling edge","rising edge","both edges"]
[null,"\"00\"","\"01\"","\"10\"","\"11\""]
[null,0,1,2,3]
[]
["reg_ldo_cfg.v_ulp_ldo[2:0]","v_ulp_ldo [V]","reg_ldo_cfg.v_ulp_ldo[2:0]","reg_ldo_cfg.v_ulp_ldo[2:0]"]
[0,1.2,"\"000\"",0]
[1,1.55,"\"001\"",{"$f":"D114+1","v":1}]
[10,1.65,"\"010\"",{"$f":"D115+1","v":2}]
[11,1.8,"\"011\"",3]
[100,2,"\"100\"",4]
[101,2.2000000000000002,"\"101\"",5]
[110,2.4,"\"110\"",6]
[111,2.6,"\"111\"",7]
[]
[]
["VAUX[i] connection configuration","to VDD_STS","to VAUX LDO","Auto, float if off","Auto, grounded if off"]
[null,"\"00\"","\"01\"","\"10\"","\"11\""]
[null,0,1,2,3]
[]
["reg_ldo_cfg.v_aux_ldo[2:0]","v_aux_ldo [V]","reg_aux_cfg.v_ulp_ldo[2:0]","reg_ldo_cfg.v_aux_ldo[2:0]"]
[0,1.2,"\"000\"",0]
[1,1.55,"\"001\"",{"$f":"D129+1","v":1}]
[10,1.65,"\"010\"",{"$f":"D130+1","v":2}]
[11,1.8,"\"011\"",3]
[100,2,"\"100\"",4]
[101,2.2000000000000002,"\"101\"",5]
[110,2.4,"\"110\"",6]
[111,2.6,"\"111\"",7]
[]
["VAUX_GND[i] connection configuration","whatever STS","Auto connect"]
[null,"'0'","'1'"]
[null,0,1]
[]
["USB current",0,5,10,20]
[null,"\"00\"","\"01\"","\"10\"","\"11\""]
[null,0,1,2,3]
[]
[]
["Serial interface settings","Standard","Hi-speed"]
["SPI config","4 wires","3 wires"]
[null,"'0'","'1'"]
[null,0,1]
[]
["Data base","hex","dec","bin"]
[]
["vcs_hi",1.3]
[]
[null,"usb_ldo_frc_dis","dis_vaux_gnd2_hrv_low","dis_vaux_gnd1_hrv_low","dis_vaux_gnd0_hrv_low","dis_vaux2_hrv_low","dis_vaux1_hrv_low","dis_vaux0_hrv_low","dis_vsup_hrv_low"]
["0","USB LDO on","VAUX_GND2 on in HRV_LOW","VAUX_GND1 on in HRV_LOW","VAUX_GND0 on in HRV_LOW","VAUX2 on in HRV_LOW","VAUX1 on in HRV_LOW","VAUX0 on in HRV_LOW","VSUP on in HRV_LOW"]
["1","USB LDO off","VAUX_GND2 off in HRV_LOW","VAUX_GND1 off in HRV_LOW","VAUX_GND0 off in HRV_LOW","VAUX2 off in HRV_LOW","VAUX1 off in HRV_LOW","VAUX0 off in HRV_LOW","VSUP off in HRV_LOW"]
[]
[]
[null,"sdi_slopectrl","wake_up_deb_en",null,null,"usb_frc_hrv_low_hiz","usb_frc_bat_low_hiz"]
["0","I2C std speed","wake-up debouncer off",null,null,"HRV_LOW hi-z if USB off","BAT_LOW hi-z if USB off"]
["1","I2C hi-speed","wake-up debouncer on",null,null,"HRV_LOW hi-z if USB on","BAT_LOW hi-z if USB on"]
[]
[null,"wake_up_edge_cfg"]
["00","wake-up disabled"]
["01","wake-up on falling edge"]
["10","wake-up on rising edge"]
["11","wake-up on both edges"]
[]
[null,"usb_crt_src_sel"]
["00","USB crt source 0 mA"]
["01","USB crt source 5 mA"]
["10","USB crt source 10 mA"]
["11","USB crt source 20 mA"]
[]
[1,"SPI 3 wires"]
[0,"SPI 4 wires"]
[]
[null,"frc_prim_dcdc_dis","vaux_gnd2_en","vaux_gnd1_en","vaux_gnd0_en","vaux2_en","vaux1_en","vaux0_en","sleep_vsup"]
["0","DCDC on at start-up","VAUX_GND2 off at start-up","VAUX_GND1 off at start-up","VAUX_GND0 off at start-up","VAUX2 off at start-up","VAUX1 off at start-up","VAUX0 off at start-up","VSUP on at start-up"]
["1","DCDC off at start-up","VAUX_GND2 on at start-up","VAUX_GND1 on at start-up","VAUX_GND0 on at start-up","VAUX2 on at start-up","VAUX1 on at start-up","VAUX0 on at start-up","VSUP sleep at start-up"]
[]
[]
[1,"HRV check by Ishort-cut"]
[0,"HRV check by Vopen-voltage"]
[]
[]
[null,"prim_cell_connect","prim_cell","no_bat_protect"]
[0,"STS/LTS disconnet at start-up","rechargeable battery","battery protection on"]
[1,"STS/LTS connect at start-up","non-rechargeable battery","battery protection off"]
[]
[]
[null,"vsup_tied_low","frc_ulp_ldo"]
[0,"VSUP float when off","VSUP LDO auto"]
[1,"VSUP to GND when off","VSUP LDO forced"]

{"sheet":"messages","index":4,"n_rows":81,"n_cols":1,"rows_kept":81,"cut":false,"hidden":true,"merged":[]}
["Exception messages"]
["ERRORS:"]
[{"$f":"(\"ERROR: TEG resistivity cannot be higher than \"&constants!D18&\" Ohm when v_bat_max_hi > 3V\")","v":"ERROR: TEG resistivity cannot be higher than 3350 Ohm when v_bat_max_hi > 3V"}]
[{"$f":"(\"ERROR: TEG resistivity cannot be higher than \"&constants!C18&\" Ohm when v_bat_max_hi is in the range 2V-3V\")","v":"ERROR: TEG resistivity cannot be higher than 5000 Ohm when v_bat_max_hi is in the range 2V-3V"}]
[{"$f":"(\"ERROR: TEG resistivity cannot be higher than \"&constants!B18&\" Ohm when v_bat_max_hi < 2V\")","v":"ERROR: TEG resistivity cannot be higher than 5000 Ohm when v_bat_max_hi < 2V"}]
["ERROR: TEG resistivity shall not be higher than 5000 Ohm"]
[{"$f":"\"ERROR: Maximum HRV open voltage higher than \"&constants!D22&\" V\"","v":"ERROR: Maximum HRV open voltage higher than 1.8 V"}]
["ERROR: Vpp_min is too low for v_bat_max_hi range"]
["ERROR: Chrv is out of range 4.7uF - 10uF"]
["ERROR: Effective Ihrv_lim is lower than absolute minimum allowed"]
["ERROR: t_hrv_meas longer than maximum configurable value"]
[{"$f":"\"ERROR: Effective t_hrv_meas shorter than \"&settings!B30&\" ms\"","v":"ERROR: Effective t_hrv_meas shorter than 3 ms"}]
["ERROR: t_hrv_period too short compare to t_hrv_meas"]
[{"$f":"\"ERROR: max battery voltage is set higher than \"&constants!$D$67&\"V\"","v":"ERROR: max battery voltage is set higher than 4.2V"}]
["ERROR: v_apl_max_hi is set lower or too close to v_bat_min_lo"]
[{"$f":"\"ERROR: v_apl_max_hi is set higher than \"&constants!$D$67&\"V\"","v":"ERROR: v_apl_max_hi is set higher than 4.2V"}]
[{"$f":"\"ERROR: min battery voltage is lower than \"&constants!B68&\"V\"","v":"ERROR: min battery voltage is lower than 1.47V"}]
["ERROR: min & max battery voltages are too close"]
["ERROR: v_bat_max_hi is set lower or too close to v_bat_min_lo"]
[{"$f":"\"ERROR: Csup too low, shall be at least \"&constants!B71&\"uF when ULP LDO is used\"","v":"ERROR: Csup too low, shall be at least 1uF when ULP LDO is used"}]
[{"$f":"\"ERROR: Caux0 too low, shall be at least \"&constants!B72&\"uF when VAUX LDO is used\"","v":"ERROR: Caux0 too low, shall be at least 1uF when VAUX LDO is used"}]
[{"$f":"\"ERROR: Caux1 too low, shall be at least \"&constants!B73&\"uF when VAUX LDO is used\"","v":"ERROR: Caux1 too low, shall be at least 1uF when VAUX LDO is used"}]
[{"$f":"\"ERROR: Caux2 too low, shall be at least \"&constants!B74&\"uF when VAUX LDO is used\"","v":"ERROR: Caux2 too low, shall be at least 1uF when VAUX LDO is used"}]
["ERROR: Csts shall be at least 10uF"]
["ERROR: Csts is lower than 10uF"]
["ERROR: Tsts shall not be bigger than 256ms"]
[{"$f":"\"ERROR: Effective Tsts_period shall be higher or equal to \"&CEILING(settings!B61,1)&\" ms\"","v":"ERROR: Effective Tsts_period shall be higher or equal to 1 ms"}]
["ERROR: v_bat_min_hi_dis is higher or too close to v_apl_max_hi: increase Csts or increase VLDloss"]
["ERROR: v_apl_max_lo is lower or too close to v_bat_min_hi_dis or v_bat_min_hi_con: increase Csts or increase VLDloss"]
["ERROR: v_bat_min_hi_con is higher or too close to v_apl_max_hi: v_apl_max_hi is extremely low"]
["ERROR: Not enough margin between v_apl_max_lo and v_apl_max_hi: increase Csts or decrease Tsts_period"]
["ERROR: Not enough margin between v_apl_max_lo and v_bat_min_hi_dis: voltage peaks on STS too high: decrease Tlts_charge_min, Increase Csts or increase VLDloss"]
["ERROR: v_apl_max_lo is lower or too close to v_bat_min_hi_con: v_apl_max_lo is extremely low"]
["ERROR: Not enough margin between v_bat_max_lo and v_bat_min_hi_dis: voltage peaks on STS too high: decrease Tlts_charge_min, Increase Csts or increase VLDloss"]
["ERROR: Not enough margin between v_bat_max_hi and v_apl_max_hi: reduce maximum application voltage or set set v_apl_max_hi = v_bat_max_hi"]
["ERROR: Not enough margin between v_bat_max_lo and v_apl_max_hi: reduce maximum application voltage or set set v_apl_max_hi = v_bat_max_hi"]
["ERROR: v_bat_max_lo is lower or too close to v_bat_min_hi_con: v_bat_max_lo is extremely low"]
["ERROR: t_sleep_vsup is higher than the maximum delay of 4h 39min 37s 215ms"]
["ERROR: t_sleep_vsup must be higher than 0s"]
["ERROR: I2C address out of range (>7F)"]
["ERROR: shall not be enabled at start-up is unused"]
["ERROR"]
["FATAL ERRORS:"]
["FATAL ERROR: v_bat_max_hi shall be higher than v_bat_max_lo"]
["FATAL ERROR: v_apl_max_hi shall be higher than v_apl_max_lo"]
["FATAL ERROR: v_bat_min_hi shall be higher than v_bat_min_lo"]
["FATAL ERROR: v_bat_min_hi shall be lower than v_apl_max_lo"]
["FATAL ERROR: v_bat_min_hi shall be lower than v_bat_max_lo"]
["FATAL ERROR: wake_up_edge_cfg[1:0] cannot be set to \"00\""]
["WARNINGS:"]
["WARNING: MPPT ratio for a TEG is usually 50%"]
["WARNING: MPPT ratio for a solar cell is usually close to 80%"]
["WARNING: Open voltage measurement method should be used to supervise a TEG"]
["WARNING: Short-cut measurement method should be used to supervise a Solar cell"]
["WARNING: t_hrv_period short compare to t_hrv_meas; high efficiency loss in HRV check and sampling"]
["WARNING: LTS/STS shall not be always connected to each other with a non-rechargeable battery."]
["WARNING: no under voltage protection on LTS has been set"]
["WARNING: \"Rechargeable battery = No\" AND \"STS always connected to LTS = Yes\" set together. "]
["WARNING: VSUP IS DISABLED IN HRV LOW MODE. IT IS STRONGLY RECOMMANDED TO AVOID THAT."]
["WARNING: ULP LDO voltage level is lower than v_bat_max_lo; the ULP LDO could act as a follower, not as a regulator"]
["WARNING: VAUX[0] and VSUP could be at different voltage domain"]
["WARNING: VAUX[1] and VSUP could be at different voltage domain"]
["WARNING: VAUX[2] and VSUP could be at different voltage domain"]
["WARNING: VAUX LDO voltage level is lower than v_bat_max_lo; the VAUX LDO could act as a follower, not as a regulator"]
["WARNING: Some registers have been overwritten in the register map"]
["WARNING: WAKE-UP SHALL BE ENABLED WHEN VSUP IS IN SLEEP CONDITION AT START-UP"]
["WARNING"]
["NOTES:"]
["Note: the power consumption of the HRV supervisory & sampling in HRV LOW mode is: "]
["Note: the power consumption of the VLD use to measure LTS is: "]
["Note: the power consumption of the VLD use to measure LTS in HRV LOW mode is: "]
["START-UP"]
["MAINTAIN STS"]
["CONNECT APPLI"]
["OPERATING"]
["CONNECT LTS/STS"]
[]
["All OK"]
["OK"]
["OK (Non applicable)"]
["N.A. short-cut method used"]

{"sheet":"txt source","index":5,"n_rows":53,"n_cols":2,"rows_kept":53,"cut":false,"hidden":true,"merged":[]}
[{"$f":"'register map'!B3","v":"0x40"},{"$f":"'register map'!G3","v":"0x04"}]
[{"$f":"'register map'!B4","v":"0x41"},{"$f":"'register map'!G4","v":"0x03"}]
[{"$f":"'register map'!B5","v":"0x42"},{"$f":"'register map'!G5","v":"0x01"}]
[{"$f":"'register map'!B6","v":"0x43"},{"$f":"'register map'!G6","v":"0x02"}]
[{"$f":"'register map'!B7","v":"0x44"},{"$f":"'register map'!G7","v":"0x43"}]
[{"$f":"'register map'!B8","v":"0x45"},{"$f":"'register map'!G8","v":"0x00"}]
[{"$f":"'register map'!B9","v":"0x46"},{"$f":"'register map'!G9","v":"0x00"}]
[{"$f":"'register map'!B10","v":"0x47"},{"$f":"'register map'!G10","v":"0x30"}]
[{"$f":"'register map'!B11","v":"0x48"},{"$f":"'register map'!G11","v":"0x2D"}]
[{"$f":"'register map'!B12","v":"0x49"},{"$f":"'register map'!G12","v":"0x26"}]
[{"$f":"'register map'!B13","v":"0x4A"},{"$f":"'register map'!G13","v":"0x26"}]
[{"$f":"'register map'!B14","v":"0x4B"},{"$f":"'register map'!G14","v":"0x25"}]
[{"$f":"'register map'!B15","v":"0x4C"},{"$f":"'register map'!G15","v":"0x3F"}]
[{"$f":"'register map'!B16","v":"0x4D"},{"$f":"'register map'!G16","v":"0x3E"}]
[{"$f":"'register map'!B17","v":"0x4E"},{"$f":"'register map'!G17","v":"0xFF"}]
[{"$f":"'register map'!B18","v":"0x4F"},{"$f":"'register map'!G18","v":"0x00"}]
[{"$f":"'register map'!B19","v":"0x50"},{"$f":"'register map'!G19","v":"0x15"}]
[{"$f":"'register map'!B20","v":"0x51"},{"$f":"'register map'!G20","v":"0x00"}]
[{"$f":"'register map'!B21","v":"0x52"},{"$f":"'register map'!G21","v":"0x00"}]
[{"$f":"'register map'!B22","v":"0x53"},{"$f":"'register map'!G22","v":"0x50"}]
[{"$f":"'register map'!B23","v":"0x54"},{"$f":"'register map'!G23","v":"0xE8"}]
[{"$f":"'register map'!B24","v":"0x55"},{"$f":"'register map'!G24","v":"0x03"}]
[{"$f":"'register map'!B25","v":"0x56"},{"$f":"'register map'!G25","v":"0x00"}]
[{"$f":"'register map'!B26","v":"0x57"},{"$f":"'register map'!G26","v":"0x02"}]
[{"$f":"'register map'!B27","v":"0x58"},{"$f":"'register map'!G27","v":"0x77"}]
[{"$f":"'register map'!B28","v":"0x59"},{"$f":"'register map'!G28","v":"0x01"}]
[{"$f":"'register map'!B29","v":"0x5A"},{"$f":"'register map'!G29","v":"0xFF"}]
[{"$f":"'register map'!B30","v":"0x5B"},{"$f":"'register map'!G30","v":"0xFF"}]
[{"$f":"'register map'!B31","v":"0x5C"},{"$f":"'register map'!G31","v":"0xFF"}]
[{"$f":"'register map'!B32","v":"0x5D"},{"$f":"'register map'!G32","v":"0xFF"}]
[{"$f":"'register map'!B33","v":"0x5E"},{"$f":"'register map'!G33","v":"0xFF"}]
[{"$f":"'register map'!B34","v":"0x5F"},{"$f":"'register map'!G34","v":"0xFF"}]
[{"$f":"'register map'!B35","v":"0x60"},{"$f":"'register map'!G35","v":"0xFF"}]
[{"$f":"'register map'!B36","v":"0x61"},{"$f":"'register map'!G36","v":"0xFF"}]
[{"$f":"'register map'!B37","v":"0x62"},{"$f":"'register map'!G37","v":"0xFF"}]
[{"$f":"'register map'!B38","v":"0x63"},{"$f":"'register map'!G38","v":"0xFF"}]
[{"$f":"'register map'!B39","v":"0x64"},{"$f":"'register map'!G39","v":"0xFF"}]
[{"$f":"'register map'!B40","v":"0x65"},{"$f":"'register map'!G40","v":"0xFF"}]
[{"$f":"'register map'!B41","v":"0x66"},{"$f":"'register map'!G41","v":"0xFF"}]
[{"$f":"'register map'!B42","v":"0x67"},{"$f":"'register map'!G42","v":"0xFF"}]
[{"$f":"'register map'!B43","v":"0x68"},{"$f":"'register map'!G43","v":"0xFF"}]
[{"$f":"'register map'!B44","v":"0x69"},{"$f":"'register map'!G44","v":"0xFF"}]
[{"$f":"'register map'!B45","v":"0x6A"},{"$f":"'register map'!G45","v":"0xFF"}]
[{"$f":"'register map'!B46","v":"0x6B"},{"$f":"'register map'!G46","v":"0xFF"}]
[{"$f":"'register map'!B47","v":"0x6C"},{"$f":"'register map'!G47","v":"0xFF"}]
[{"$f":"'register map'!B48","v":"0x6D"},{"$f":"'register map'!G48","v":"0xFF"}]
[{"$f":"'register map'!B49","v":"0x6E"},{"$f":"'register map'!G49","v":"0xFF"}]
[{"$f":"'register map'!B50","v":"0x6F"},{"$f":"'register map'!G50","v":"0xFF"}]
[{"$f":"'register map'!B51","v":"0x70"},{"$f":"'register map'!G51","v":"0xFF"}]
[{"$f":"'register map'!B52","v":"0x71"},{"$f":"'register map'!G52","v":"0xFF"}]
[{"$f":"'register map'!B53","v":"0x72"},{"$f":"'register map'!G53","v":"0xFF"}]
[{"$f":"'register map'!B54","v":"0x73"},{"$f":"'register map'!G54","v":"0xFF"}]
[{"$f":"'register map'!B55","v":"0x74"},{"$f":"'register map'!G55","v":"0xFF"}]

{"sheet":"chart calc","index":6,"n_rows":376,"n_cols":27,"rows_kept":376,"cut":false,"hidden":true,"merged":[[72,24,72,26],[72,2,72,3],[72,4,72,5],[7,2,7,7],[7,9,7,11],[72,8,72,9],[72,18,72,20],[72,6,72,7],[72,21,72,23]]}
["EM8500 chart illustration calculation"]
["Description","The timing diagram is divided in 3 phases:"]
[null,"-1. start-up phase (ULV DCDC or connection to LTS depending if STS/LTS can be disconnected)"]
[null,"-2. STS maintaining if STS and LTS are disconnected otherwise operating mode"]
[null,"-3. operating mode, LTS and STS connected"]
[]
["Rechargeable battery",{"$f":"settings!B37","v":"Yes"}]
["STS always connected to LTS",{"$f":"settings!B46","v":"No"},"STS/LTS unconnected",null,null,null,null,null,null,"STS/LTS connected"]
["VLDlsb",{"$f":"constants!C64","v":7.2999999999999995E-2},null,{"$f":"IF(B12=-1,B11,B13)","v":3.3579999999999997},1.25,null,null,null,null,null,{"$f":"B10","v":3.577},2]
[{"$f":"\"v_bat_max_hi (\"&TEXT(B10,\"0.00\")&\")\"","v":"v_bat_max_hi (3.58)"},{"$f":"(settings!H15+1)*'chart calc'!B9","v":3.577},null,{"$f":"B18","v":1.3},1,null,null,null,null,null,{"$f":"F76","v":3.1025},1]
[{"$f":"\"v_bat_max_lo (\"&TEXT(B11,\"0.00\")&\")\"","v":"v_bat_max_lo (3.36)"},{"$f":"(settings!H76+1)*B9","v":3.3579999999999997},"SLOPE1",{"$f":"SLOPE(D9:D10,E9:E10)","v":8.2319999999999993},null,null,null,null,null,"SLOPE1",{"$f":"SLOPE(K9:K10,L9:L10)","v":0.47449999999999992}]
[{"$f":"\"v_apl_max_hi (\"&TEXT(B12,\"0.00\")&\")\"","v":"v_apl_max_hi (-1.00)"},{"$f":"IF(settings!H43>settings!H42,-1,(settings!H43+1)*B9)","v":-1},"INTERCEPT1",{"$f":"INTERCEPT(D9:D10,E9:E10)","v":-6.9319999999999995},null,null,null,null,null,"INTERCEPT1",{"$f":"INTERCEPT(K9:K10,L9:L10)","v":2.6280000000000001}]
[{"$f":"\"v_apl_max_lo (\"&TEXT(B13,\"0.00\")&\")\"","v":"v_apl_max_lo (-1.00)"},{"$f":"IF(settings!H43>settings!H42,-1,(settings!H73+1)*B9)","v":-1},null,{"$f":"B16","v":2.847},1.5,null,{"$f":"(B16+G14)/2","v":1.7484999999999999},1.5,null,null,{"$f":"B11","v":3.3579999999999997},2.5]
[{"$f":"\"v_bat_min_hi_dis (\"&TEXT(B14,\"0.00\")&\")\"","v":"v_bat_min_hi_dis (2.85)"},{"$f":"(settings!H66+1)*B9","v":2.847},null,{"$f":"D9","v":3.3579999999999997},1.25,null,{"$f":"D201","v":0.65},1.25,null,null,{"$f":"K9","v":3.577},2]
[{"$f":"\"v_bat_min_hi_con (\"&TEXT(B15,\"0.00\")&\")\"","v":"v_bat_min_hi_con (2.85)"},{"$f":"(settings!H67+1)*B9","v":2.847},"SLOPE2",{"$f":"SLOPE(D13:D14,E13:E14)","v":-2.0439999999999987},null,null,{"$f":"SLOPE(G13:G14,H13:H14)","v":4.3940000000000001},null,null,"SLOPE2",{"$f":"SLOPE(K13:K14,L13:L14)","v":-0.43800000000000061}]
[{"$f":"\"v_bat_min_hi (\"&TEXT(B16,\"0.00\")&\")\"","v":"v_bat_min_hi (2.85)"},{"$f":"IF(B8=\"No\",B14,B15)","v":2.847},"INTERCEPT2",{"$f":"INTERCEPT(D13:D14,E13:E14)","v":5.9129999999999985},null,null,{"$f":"INTERCEPT(G13:G14,H13:H14)","v":-4.8425000000000002},null,null,"INTERCEPT2",{"$f":"INTERCEPT(K13:K14,L13:L14)","v":4.4530000000000012}]
[{"$f":"\"v_bat_min_lo (\"&TEXT(B17,\"0.00\")&\")\"","v":"v_bat_min_lo (2.77)"},{"$f":"(settings!H17+1)*B9","v":2.774},null,{"$f":"D14","v":3.3579999999999997},1.75,null,null,null,null,null,{"$f":"K14","v":3.577},3]
[{"$f":"\"Vcs_hi (\"&TEXT(B18,\"0.00\")&\")\"","v":"Vcs_hi (1.30)"},{"$f":"constants!B154","v":1.3},null,{"$f":"D13","v":2.847},1.5,null,null,null,null,null,{"$f":"K13","v":3.3579999999999997},2.5]
[null,null,"SLOPE3",{"$f":"SLOPE(D17:D18,E17:E18)","v":2.0439999999999987},null,null,null,null,null,"SLOPE3",{"$f":"SLOPE(K17:K18,L17:L18)","v":0.43800000000000061}]
["ULP LDO",{"$f":"settings!B93","v":2.6},"INTERCEPT3",{"$f":"INTERCEPT(D17:D18,E17:E18)","v":-0.21899999999999764},null,null,null,null,null,"INTERCEPT3",{"$f":"INTERCEPT(K17:K18,L17:L18)","v":2.2629999999999981}]
["VAUX LDO",{"$f":"settings!B104","v":2.6},null,{"$f":"D18","v":2.847},2,null,{"$f":"D21","v":2.847},2]
["Force ULP LDO",{"$f":"settings!B92","v":"Yes"},null,{"$f":"D17","v":3.3579999999999997},1.75,null,{"$f":"G13","v":1.7484999999999999},1.75]
[null,null,"SLOPE4",{"$f":"SLOPE(D21:D22,E21:E22)","v":-2.0439999999999987},null,null,{"$f":"SLOPE(G21:G22,H21:H22)","v":4.3940000000000001}]
[null,null,"INTERCEPT4",{"$f":"INTERCEPT(D21:D22,E21:E22)","v":6.9349999999999978},null,null,{"$f":"INTERCEPT(G21:G22,H21:H22)","v":-5.9409999999999998}]
[]
[]
[null,null,null,{"$f":"B10","v":3.577},2.25]
["v_bat_max_hi (2.88)",null,null,{"$f":"D21","v":2.847},2]
["v_bat_max_lo",null,"SLOPE4",{"$f":"SLOPE(D27:D28,E27:E28)","v":2.92},null,null,null,null,0.3]
["v_apl_max_hi",null,"INTERCEPT4",{"$f":"INTERCEPT(D27:D28,E27:E28)","v":-2.9930000000000003},null,null,{"$f":"messages!A72","v":"START-UP"},0.5,{"$f":"$B$10+I29","v":3.8769999999999998},{"$f":"7","v":7}]
["v_apl_max_lo",null,null,{"$f":"B11","v":3.3579999999999997},2.5,null,{"$f":"IF(B8=constants!C60,messages!A73,messages!A74)","v":"MAINTAIN STS"},1.5,{"$f":"I30","v":3.8769999999999998},{"$f":"7","v":7}]
["v_bat_min_hi_dis",null,null,{"$f":"D27","v":3.577},2.25,null,{"$f":"IF(B7=constants!B60,messages!A75,messages!A76)","v":"OPERATING"},2.5,{"$f":"I31","v":3.8769999999999998},{"$f":"7","v":7}]
["v_bat_min_hi_con",null,"SLOPE5",{"$f":"SLOPE(D31:D32,E31:E32)","v":-0.87600000000000122}]
["v_bat_min_hi",null,"INTERCEPT5",{"$f":"INTERCEPT(D31:D32,E31:E32)","v":5.5480000000000027}]
["v_bat_min_lo",null,null,{"$f":"D32","v":3.577},2.75]
["Vcs_hi"]
[]
[]
[null,null,null,null,null,null,{"$f":"IF(B13=-1,B11,B13)","v":3.3579999999999997},1.25]
[null,null,null,{"$f":"D31","v":3.3579999999999997},2.5,null,{"$f":"G175","v":2.9884999999999997},1]
[null,null,"SLOPE5",{"$f":"SLOPE(D35:D40,E35:E40)","v":0.87600000000000122},null,null,"SLOPE LTS",{"$f":"SLOPE(G39:G40,H39:H40)","v":1.4779999999999998}]
[null,null,"INTERCEPT5",{"$f":"INTERCEPT(D35:D40,E35:E40)","v":1.1679999999999966},null,null,"INTERCEPT LTS",{"$f":"INTERCEPT(G39:G40,H39:H40)","v":1.5104999999999997}]
[null,null,null,{"$f":"D40","v":3.3579999999999997},3]
[null,null,null,{"$f":"D35","v":3.577},2.75,null,{"$f":"B16","v":2.847},1.5]
[null,null,"SLOPE5",{"$f":"SLOPE(D43:D44,E43:E44)","v":-0.87600000000000122},null,null,{"$f":"G39","v":3.3579999999999997},{"$f":"H39","v":1.25}]
[null,null,"INTERCEPT5",{"$f":"INTERCEPT(D43:D44,E43:E44)","v":5.9860000000000033},null,null,"SLOPE LTS",{"$f":"SLOPE(G44:G45,H44:H45)","v":-2.0439999999999987}]
[null,null,null,null,null,null,"INTERCEPT LTS",{"$f":"INTERCEPT(G44:G45,H44:H45)","v":5.9129999999999985}]
[]
[null,null,null,null,null,null,{"$f":"G45","v":3.3579999999999997},1.75]
[null,null,null,null,null,null,{"$f":"G44","v":2.847},{"$f":"H44","v":1.5}]
[null,null,null,null,null,null,"SLOPE LTS",{"$f":"SLOPE(G49:G50,H49:H50)","v":2.0439999999999987}]
[null,null,null,null,null,null,"INTERCEPT LTS",{"$f":"INTERCEPT(G49:G50,H49:H50)","v":-0.21899999999999764}]
[]
[null,null,null,null,null,null,{"$f":"H275-H74","v":2.9884999999999997},2]
[null,null,null,null,null,null,{"$f":"G49","v":3.3579999999999997},{"$f":"H49","v":1.75}]
[null,null,null,null,null,null,"SLOPE LTS",{"$f":"SLOPE(G54:G55,H54:H55)","v":-1.4779999999999998}]
[null,null,null,null,null,null,"INTERCEPT LTS",{"$f":"INTERCEPT(G54:G55,H54:H55)","v":5.9444999999999988}]
[]
[]
[]
[null,null,null,null,null,null,{"$f":"G62-H72","v":2.9034999999999997},3]
[null,null,null,null,null,null,{"$f":"H176","v":3.0034999999999998},2]
[null,null,null,null,null,null,"SLOPE LTS",{"$f":"SLOPE(G61:G62,H61:H62)","v":-0.10000000000000009}]
[null,null,null,null,null,null,"INTERCEPT LTS",{"$f":"INTERCEPT(G61:G62,H61:H62)","v":3.2035}]
[]
[null,null,null,null,null,null,{"$f":"G67-H72","v":3.0024999999999999},1]
[null,null,null,null,null,null,{"$f":"H76","v":3.1025},0]
[null,null,null,null,null,null,"SLOPE LTS",{"$f":"SLOPE(G66:G67,H66:H67)","v":-0.10000000000000009}]
[null,null,null,null,null,null,"INTERCEPT LTS",{"$f":"INTERCEPT(G66:G67,H66:H67)","v":3.1025}]
[]
[null,null,null,null,null,null,null,null,null,null,null,null,null,null,null,null,null,null,{"$f":"settings!$H$101","v":1},{"$f":"settings!$H$102","v":1},{"$f":"settings!$H$103","v":1}]
[null,null,null,null,null,null,null,0.1,null,0,0,0.01,null,null,0.01,0.02,null,null,{"$f":"IF(settings!$B$95=constants!$C$60,0,1)","v":1},{"$f":"IF(settings!$B$96=constants!$C$60,0,1)","v":1},{"$f":"IF(settings!$B$97=constants!$C$60,0,1)","v":1},0,0,0,0.03,3.5000000000000003E-2,0.04]
[null,null,"STS/LTS unconnected",null,"STS/LTS connected",null,"Primary cell",null,"EFFECTIVE",null,null,"VSUP to STS","VSUP to LDO2","VSUP to LDO1","VSUP intermadiate","EFFECTIVE","VAUX to LDO1","VAUX to LDO","VAUX SELECTION",null,null,"VAUX SELECTION WITHOUT OFFSET",null,null,"EFFECTIVE"]
[null,null,0.3,1.4999999999999999E-2,0.01,1.4999999999999999E-2,0.01,1.4999999999999999E-2,null,null,null,1,1,1,0.9,1,1,1,1,1,1,0.9,0.9,0.9,0.9,0.9,0.9]
["phase","t","VDD_STS","VDD_LTS","VDD_STS","VDD_LTS","VDD_STS","VDD_LTS","VDD_STS","VDD_LTS","HYST STS VS BAT_MIN","VSUP","VSUP","VSUP","VSUP","VSUP","VAUX","VAUX","VAUX0","VAUX1","VAUX2","VAUX0","VAUX1","VAUX2","VAUX0","VAUX1","VAUX2"]
[{"$f":"IF(B76<=100,1,IF(B76<=200,2,3))","v":1},0,{"$f":"$B$18/(1-EXP(-1/C$74))*(1-EXP(-$B76/C$74))","v":0},{"$f":"$B$18/2","v":0.65},{"$f":"($F$76-$F$74)/(1-EXP(-1/E$74))*(1-EXP(-$B76/E$74))","v":0},{"$f":"IF(B12=-1,(B11+B16)/2,(B11+B16)/2)","v":3.1025},{"$f":"(H76-$H$74)/(1-EXP(-1/G$74))*(1-EXP(-$B76/G$74))","v":0},{"$f":"IF(B12=-1,(B11+B16)/2,(B11+B16)/2)","v":3.1025},{"$f":"IF($B$7=constants!$C$60,G76,IF($B$8=constants!$C$60,C76,E76))","v":0},{"$f":"IF($B$7=constants!$C$60,H76,IF($B$8=constants!$C$60,D76,F76))","v":0.65},0,0,0,0,0,{"$f":"IF(O76=0,0,O76-$P$72)","v":0},0,0,{"$f":"S$72*IF(S$71=0,$L76,IF(S$71=1,$R76,IF($B$12=-1,$L76,IF($I76>$B$12,$R76,$L76))))","v":0},{"$f":"T$72*IF(T$71=0,$L76,IF(T$71=1,$R76,IF($B$12=-1,$L76,IF($I76>$B$12,$R76,$L76))))","v":0},{"$f":"U$72*IF(U$71=0,$L76,IF(U$71=1,$R76,IF($B$12=-1,$L76,IF($I76>$B$12,$R76,$L76))))","v":0},0,0,0,{"$f":"IF(V76=0,0,V76-Y$72)","v":0},{"$f":"IF(W76=0,0,W76-Z$72)","v":0},{"$f":"IF(X76=0,0,X76-AA$72)","v":0}]
[{"$f":"IF(B77<=100,1,IF(B77<=200,2,3))","v":1},{"$f":"B76+0.01","v":0.01},{"$f":"$B$18/(1-EXP(-1/$C$74))*(1-EXP(-B77/$C$74))","v":4.4195706720931975E-2},{"$f":"D76","v":0.65},1.9516722253831718,{"$f":"F76","v":3.1025},1.9510401048243433,{"$f":"$H$68*B77+$H$69","v":3.1015000000000001},{"$f":"IF($B$7=constants!$C$60,G77,IF($B$8=constants!$C$60,C77,E77))","v":4.4195706720931975E-2},{"$f":"IF($B$7=constants!$C$60,H77,IF($B$8=constants!$C$60,D77,F77))","v":0.65},{"$f":"IF(AND(I77>$B$16,K76=0),1,IF(AND(I77<$B$17,K76=1),0,K76))","v":0},0,0,{"$f":"IF(M77>I77,L77,M77)","v":0},{"$f":"IF(OR($B$22=constants!$B$60,AND(I77>$B$12,$B$12<>-1)),O76+(N77-O76)*$O$74,O76+(L77-O76)*$O$74)","v":0},{"$f":"IF(O77=0,0,O77-$P$72)","v":0},0,{"$f":"IF(Q77>I77,I77,Q77)","v":0},{"$f":"S$72*IF(S$71=0,$L77,IF(S$71=1,$R77,IF($B$12=-1,$L77,IF($I77>$B$12,$R77,$L77))))","v":0},0,0,{"$f":"V76+(S77-V$72-V76)*V$74","v":0},{"$f":"W76+(T77-W$72-W76)*W$74","v":0},{"$f":"X76+(U77-X$72-X76)*X$74","v":0},{"$f":"IF(V77=0,0,V77-Y$72)","v":0},{"$f":"IF(W77=0,0,W77-Z$72)","v":0},{"$f":"IF(X77=0,0,X77-AA$72)","v":0}]
[1,{"$f":"B77+0.01","v":0.02},8.6942505833598124E-2,{"$f":"D77","v":0.65},2.6696523130069583,{"$f":"F77","v":3.1025},2.6679229835734315,3.1005000000000003,{"$f":"IF($B$7=constants!$C$60,G78,IF($B$8=constants!$C$60,C78,E78))","v":8.6942505833598124E-2},{"$f":"IF($B$7=constants!$C$60,H78,IF($B$8=constants!$C$60,D78,F78))","v":0.65},{"$f":"IF(AND(I78>$B$16,K77=0),1,IF(AND(I78<$B$17,K77=1),0,K77))","v":0},0,0,0,{"$f":"IF(OR($B$22=constants!$B$60,AND(I78>$B$12,$B$12<>-1)),O77+(N78-O77)*$O$74,O77+(L78-O77)*$O$74)","v":0},0,0,{"$f":"IF(Q78>I78,I78,Q78)","v":0},0,0,0,{"$f":"V77+(S78-V$72-V77)*V$74","v":0},{"$f":"W77+(T78-W$72-W77)*W$74","v":0},{"$f":"X77+(U78-X$72-X77)*X$74","v":0},0,0,0]
[1,0.03,0.12828789817943895,0.65,2.9337824264142198,3.1025,2.9309317876193233,3.0994999999999999,{"$f":"IF($B$7=constants!$C$60,G79,IF($B$8=constants!$C$60,C79,E79))","v":0.12828789817943895},{"$f":"IF($B$7=constants!$C$60,H79,IF($B$8=constants!$C$60,D79,F79))","v":0.65},0,0,0,0,{"$f":"IF(OR($B$22=constants!$B$60,AND(I79>$B$12,$B$12<>-1)),O78+(N79-O78)*$O$74,O78+(L79-O78)*$O$74)","v":0},0,0,0,0,0,0,0,0,0,0,0,0]
[1,0.04,0.16827782733708141,0.65,3.030950464931033,3.1025,3.0270237274865881,3.0985,{"$f":"IF($B$7=constants!$C$60,G80,IF($B$8=constants!$C$60,C80,E80))","v":0.16827782733708141},{"$f":"IF($B$7=constants!$C$60,H80,IF($B$8=constants!$C$60,D80,F80))","v":0.65},0,0,0,0,{"$f":"IF(OR($B$22=constants!$B$60,AND(I80>$B$12,$B$12<>-1)),O79+(N80-O79)*$O$74,O79+(L80-O79)*$O$74)","v":0},0,0,0,0,0,0,0,0,0,0,0,0]
[1,0.05,0.20695673067548825,0.65,3.0666965886403235,3.1025,3.0617302783753191,3.0975000000000001,{"$f":"IF($B$7=constants!$C$60,G81,IF($B$8=constants!$C$60,C81,E81))","v":0.20695673067548825},{"$f":"IF($B$7=constants!$C$60,H81,IF($B$8=constants!$C$60,D81,F81))","v":0.65},0,0,0,0,{"$f":"IF(OR($B$22=constants!$B$60,AND(I81>$B$12,$B$12<>-1)),O80+(N81-O80)*$O$74,O80+(L81-O80)*$O$74)","v":0},0,0,0,0,0,0,0,0,0,0,0,0]
[1,6.0000000000000005E-2,0.24436758873338243,0.65,3.0798468526545424,3.1025,3.0738617251676024,3.0964999999999998,{"$f":"IF($B$7=constants!$C$60,G82,IF($B$8=constants!$C$60,C82,E82))","v":0.24436758873338243},{"$f":"IF($B$7=constants!$C$60,H82,IF($B$8=constants!$C$60,D82,F82))","v":0.65},0,0,0,0,{"$f":"IF(OR($B$22=constants!$B$60,AND(I82>$B$12,$B$12<>-1)),O81+(N82-O81)*$O$74,O81+(L82-O81)*$O$74)","v":0},0,0,0,0,0,0,0,0,0,0,0,0]
[1,7.0000000000000007E-2,0.2805519729798247,0.65,3.0846845644313503,3.1025,3.0776909476051091,3.0954999999999999,{"$f":"IF($B$7=constants!$C$60,G83,IF($B$8=constants!$C$60,C83,E83))","v":0.2805519729798247},{"$f":"IF($B$7=constants!$C$60,H83,IF($B$8=constants!$C$60,D83,F83))","v":0.65},0,0,0,0,{"$f":"IF(OR($B$22=constants!$B$60,AND(I83>$B$12,$B$12<>-1)),O82+(N83-O82)*$O$74,O82+(L83-O82)*$O$74)","v":0},0,0,0,0,0,0,0,0,0,0,0,0]
[1,0.08,0.31555009200901107,0.65,3.0864642591363509,3.1025,3.0784669428373741,3.0945,{"$f":"IF($B$7=constants!$C$60,G84,IF($B$8=constants!$C$60,C84,E84))","v":0.31555009200901107},{"$f":"IF($B$7=constants!$C$60,H84,IF($B$8=constants!$C$60,D84,F84))","v":0.65},0,0,0,0,{"$f":"IF(OR($B$22=constants!$B$60,AND(I84>$B$12,$B$12<>-1)),O83+(N84-O83)*$O$74,O83+(L84-O83)*$O$74)","v":0},0,0,0,0,0,0,0,0,0,0,0,0]
[1,0.09,0.34940083622062584,0.65,3.0871189722298822,3.1025,3.0781200829181192,3.0935000000000001,{"$f":"IF($B$7=constants!$C$60,G85,IF($B$8=constants!$C$60,C85,E85))","v":0.34940083622062584},{"$f":"IF($B$7=constants!$C$60,H85,IF($B$8=constants!$C$60,D85,F85))","v":0.65},0,0,0,0,{"$f":"IF(OR($B$22=constants!$B$60,AND(I85>$B$12,$B$12<>-1)),O84+(N85-O84)*$O$74,O84+(L85-O84)*$O$74)","v":0},0,0,0,0,0,0,0,0,0,0,0,0]
[1,9.9999999999999992E-2,0.38214182103539768,0.65,3.0873598277168584,3.1025,3.0773602817161563,3.0925000000000002,{"$f":"IF($B$7=constants!$C$60,G86,IF($B$8=constants!$C$60,C86,E86))","v":0.38214182103539768},{"$f":"IF($B$7=constants!$C$60,H86,IF($B$8=constants!$C$60,D86,F86))","v":0.65},0,0,0,0,{"$f":"IF(OR($B$22=constants!$B$60,AND(I86>$B$12,$B$12<>-1)),O85+(N86-O85)*$O$74,O85+(L86-O85)*$O$74)","v":0},0,0,0,0,0,0,0,0,0,0,0,0]
[1,0.10999999999999999,0.41380942869388193,0.65,3.0874484334988099,3.1025,3.0764486172175185,3.0914999999999999,{"$f":"IF($B$7=constants!$C$60,G87,IF($B$8=constants!$C$60,C87,E87))","v":0.41380942869388193},{"$f":"IF($B$7=constants!$C$60,H87,IF($B$8=constants!$C$60,D87,F87))","v":0.65},0,0,0,0,{"$f":"IF(OR($B$22=constants!$B$60,AND(I87>$B$12,$B$12<>-1)),O86+(N87-O86)*$O$74,O86+(L87-O86)*$O$74)","v":0},0,0,0,0,0,0,0,0,0,0,0,0]
[1,0.11999999999999998,0.44443884868491507,0.65,3.0874810297443589,3.1025,3.0754811034749072,3.0905,{"$f":"IF($B$7=constants!$C$60,G88,IF($B$8=constants!$C$60,C88,E88))","v":0.44443884868491507},{"$f":"IF($B$7=constants!$C$60,H88,IF($B$8=constants!$C$60,D88,F88))","v":0.65},0,0,0,0,{"$f":"IF(OR($B$22=constants!$B$60,AND(I88>$B$12,$B$12<>-1)),O87+(N88-O87)*$O$74,O87+(L88-O87)*$O$74)","v":0},0,0,0,0,0,0,0,0,0,0,0,0]
[1,0.12999999999999998,0.47406411684866784,0.65,3.0874930212329557,3.1025,3.0744930506172383,3.0895000000000001,{"$f":"IF($B$7=constants!$C$60,G89,IF($B$8=constants!$C$60,C89,E89))","v":0.47406411684866784},{"$f":"IF($B$7=constants!$C$60,H89,IF($B$8=constants!$C$60,D89,F89))","v":0.65},0,0,0,0,{"$f":"IF(OR($B$22=constants!$B$60,AND(I89>$B$12,$B$12<>-1)),O88+(N89-O88)*$O$74,O88+(L89-O88)*$O$74)","v":0},0,0,0,0,0,0,0,0,0,0,0,0]
[1,0.13999999999999999,0.50271815319774638,0.65,3.0874974326550797,3.1025,3.073497444296482,3.0885000000000002,{"$f":"IF($B$7=constants!$C$60,G90,IF($B$8=constants!$C$60,C90,E90))","v":0.50271815319774638},{"$f":"IF($B$7=constants!$C$60,H90,IF($B$8=constants!$C$60,D90,F90))","v":0.65},0,0,0,0,{"$f":"IF(OR($B$22=constants!$B$60,AND(I90>$B$12,$B$12<>-1)),O89+(N90-O89)*$O$74,O89+(L90-O89)*$O$74)","v":0},0,0,0,0,0,0,0,0,0,0,0,0]
[1,0.15,0.53043279849837199,0.65,3.0874990555265853,3.1025,3.0724990601151201,3.0874999999999999,{"$f":"IF($B$7=constants!$C$60,G91,IF($B$8=constants!$C$60,C91,E91))","v":0.53043279849837199},{"$f":"IF($B$7=constants!$C$60,H91,IF($B$8=constants!$C$60,D91,F91))","v":0.65},0,0,0,0,{"$f":"IF(OR($B$22=constants!$B$60,AND(I91>$B$12,$B$12<>-1)),O90+(N91-O90)*$O$74,O90+(L91-O90)*$O$74)","v":0},0,0,0,0,0,0,0,0,0,0,0,0]
[1,0.16,0.55723884965228487,0.65,3.0874996525476481,3.1025,3.0714996543482105,3.0865,{"$f":"IF($B$7=constants!$C$60,G92,IF($B$8=constants!$C$60,C92,E92))","v":0.55723884965228487},{"$f":"IF($B$7=constants!$C$60,H92,IF($B$8=constants!$C$60,D92,F92))","v":0.65},0,0,0,0,{"$f":"IF(OR($B$22=constants!$B$60,AND(I92>$B$12,$B$12<>-1)),O91+(N92-O91)*$O$74,O91+(L92-O91)*$O$74)","v":0},0,0,0,0,0,0,0,0,0,0,0,0]
[1,0.17,0.5831660939186939,0.65,3.0874998721794231,3.1025,3.0704998728832127,3.0855000000000001,{"$f":"IF($B$7=constants!$C$60,G93,IF($B$8=constants!$C$60,C93,E93))","v":0.5831660939186939},{"$f":"IF($B$7=constants!$C$60,H93,IF($B$8=constants!$C$60,D93,F93))","v":0.65},0,0,0,0,{"$f":"IF(OR($B$22=constants!$B$60,AND(I93>$B$12,$B$12<>-1)),O92+(N93-O92)*$O$74,O92+(L93-O92)*$O$74)","v":0},0,0,0,0,0,0,0,0,0,0,0,0]
[1,0.18000000000000002,0.6082433420142942,0.65,3.0874999529774376,3.1025,3.0694999532515768,3.0844999999999998,{"$f":"IF($B$7=constants!$C$60,G94,IF($B$8=constants!$C$60,C94,E94))","v":0.6082433420142942},{"$f":"IF($B$7=constants!$C$60,H94,IF($B$8=constants!$C$60,D94,F94))","v":0.65},0,0,0,0,{"$f":"IF(OR($B$22=constants!$B$60,AND(I94>$B$12,$B$12<>-1)),O93+(N94-O93)*$O$74,O93+(L94-O93)*$O$74)","v":0},0,0,0,0,0,0,0,0,0,0,0,0]
[1,0.19000000000000003,0.6324984601281407,0.65,3.0874999827013658,3.1025,3.0684999828078188,3.0834999999999999,{"$f":"IF($B$7=constants!$C$60,G95,IF($B$8=constants!$C$60,C95,E95))","v":0.6324984601281407},{"$f":"IF($B$7=constants!$C$60,H95,IF($B$8=constants!$C$60,D95,F95))","v":0.65},0,0,0,0,{"$f":"IF(OR($B$22=constants!$B$60,AND(I95>$B$12,$B$12<>-1)),O94+(N95-O94)*$O$74,O94+(L95-O94)*$O$74)","v":0},0,0,0,0,0,0,0,0,0,0,0,0]
[1,0.20000000000000004,0.65595840088694579,0.65,3.0874999936361882,3.1025,3.0674999936774112,3.0825,{"$f":"IF($B$7=constants!$C$60,G96,IF($B$8=constants!$C$60,C96,E96))","v":0.65595840088694579},{"$f":"IF($B$7=constants!$C$60,H96,IF($B$8=constants!$C$60,D96,F96))","v":0.65},0,0,0,0,{"$f":"IF(OR($B$22=constants!$B$60,AND(I96>$B$12,$B$12<>-1)),O95+(N96-O95)*$O$74,O95+(L96-O95)*$O$74)","v":0},0,0,0,0,0,0,0,0,0,0,0,0]
[1,0.21000000000000005,0.67864923330521598,0.65,3.0874999976588846,3.1025,3.066499997674808,3.0815000000000001,{"$f":"IF($B$7=constants!$C$60,G97,IF($B$8=constants!$C$60,C97,E97))","v":0.67864923330521598},{"$f":"IF($B$7=constants!$C$60,H97,IF($B$8=constants!$C$60,D97,F97))","v":0.65},0,0,0,0,{"$f":"IF(OR($B$22=constants!$B$60,AND(I97>$B$12,$B$12<>-1)),O96+(N97-O96)*$O$74,O96+(L97-O96)*$O$74)","v":0},0,0,0,0,0,0,0,0,0,0,0,0]
[1,0.22000000000000006,0.70059617175350608,0.65,3.0874999991387519,3.1025,3.0654999991448886,3.0804999999999998,{"$f":"IF($B$7=constants!$C$60,G98,IF($B$8=constants!$C$60,C98,E98))","v":0.70059617175350608},{"$f":"IF($B$7=constants!$C$60,H98,IF($B$8=constants!$C$60,D98,F98))","v":0.65},0,0,0,0,{"$f":"IF(OR($B$22=constants!$B$60,AND(I98>$B$12,$B$12<>-1)),O97+(N98-O97)*$O$74,O97+(L98-O97)*$O$74)","v":0},0,0,0,0,0,0,0,0,0,0,0,0]
[1,0.23000000000000007,0.72182360397697987,0.65,3.0874999996831645,3.1025,3.0644999996855247,3.0794999999999999,{"$f":"IF($B$7=constants!$C$60,G99,IF($B$8=constants!$C$60,C99,E99))","v":0.72182360397697987},{"$f":"IF($B$7=constants!$C$60,H99,IF($B$8=constants!$C$60,D99,F99))","v":0.65},0,0,0,0,{"$f":"IF(OR($B$22=constants!$B$60,AND(I99>$B$12,$B$12<>-1)),O98+(N99-O98)*$O$74,O98+(L99-O98)*$O$74)","v":0},0,0,0,0,0,0,0,0,0,0,0,0]
[1,0.24000000000000007,0.74235511819541411,0.65,3.0874999998834425,3.1025,3.0634999998843484,3.0785,{"$f":"IF($B$7=constants!$C$60,G100,IF($B$8=constants!$C$60,C100,E100))","v":0.74235511819541411},{"$f":"IF($B$7=constants!$C$60,H100,IF($B$8=constants!$C$60,D100,F100))","v":0.65},0,0,0,0,{"$f":"IF(OR($B$22=constants!$B$60,AND(I100>$B$12,$B$12<>-1)),O99+(N100-O99)*$O$74,O99+(L100-O99)*$O$74)","v":0},0,0,0,0,0,0,0,0,0,0,0,0]
[1,0.25000000000000006,0.76221352931475905,0.65,3.0874999999571209,3.1025,3.0624999999574682,3.0775000000000001,{"$f":"IF($B$7=constants!$C$60,G101,IF($B$8=constants!$C$60,C101,E101))","v":0.76221352931475905},{"$f":"IF($B$7=constants!$C$60,H101,IF($B$8=constants!$C$60,D101,F101))","v":0.65},0,0,0,0,{"$f":"IF(OR($B$22=constants!$B$60,AND(I101>$B$12,$B$12<>-1)),O100+(N101-O100)*$O$74,O100+(L101-O100)*$O$74)","v":0},0,0,0,0,0,0,0,0,0,0,0,0]
[1,0.26000000000000006,0.78142090427938027,0.65,3.0874999999842254,3.1025,3.061499999984358,3.0764999999999998,{"$f":"IF($B$7=constants!$C$60,G102,IF($B$8=constants!$C$60,C102,E102))","v":0.78142090427938027},{"$f":"IF($B$7=constants!$C$60,H102,IF($B$8=constants!$C$60,D102,F102))","v":0.65},0,0,0,0,{"$f":"IF(OR($B$22=constants!$B$60,AND(I102>$B$12,$B$12<>-1)),O101+(N102-O101)*$O$74,O101+(L102-O101)*$O$74)","v":0},0,0,0,0,0,0,0,0,0,0,0,0]
[1,0.27000000000000007,0.79999858659315692,0.65,3.087499999994197,3.1025,3.0604999999942475,3.0754999999999999,{"$f":"IF($B$7=constants!$C$60,G103,IF($B$8=constants!$C$60,C103,E103))","v":0.79999858659315692},{"$f":"IF($B$7=constants!$C$60,H103,IF($B$8=constants!$C$60,D103,F103))","v":0.65},0,0,0,0,{"$f":"IF(OR($B$22=constants!$B$60,AND(I103>$B$12,$B$12<>-1)),O102+(N103-O102)*$O$74,O102+(L103-O102)*$O$74)","v":0},0,0,0,0,0,0,0,0,0,0,0,0]
[1,0.28000000000000008,0.81796722003668154,0.65,3.0874999999978652,3.1025,3.0594999999978842,3.0745,{"$f":"IF($B$7=constants!$C$60,G104,IF($B$8=constants!$C$60,C104,E104))","v":0.81796722003668154},{"$f":"IF($B$7=constants!$C$60,H104,IF($B$8=constants!$C$60,D104,F104))","v":0.65},0,0,0,0,{"$f":"IF(OR($B$22=constants!$B$60,AND(I104>$B$12,$B$12<>-1)),O103+(N104-O103)*$O$74,O103+(L104-O103)*$O$74)","v":0},0,0,0,0,0,0,0,0,0,0,0,0]
[1,0.29000000000000009,0.83534677160691795,0.65,3.0874999999992148,3.1025,3.058499999999222,3.0735000000000001,{"$f":"IF($B$7=constants!$C$60,G105,IF($B$8=constants!$C$60,C105,E105))","v":0.83534677160691795},{"$f":"IF($B$7=constants!$C$60,H105,IF($B$8=constants!$C$60,D105,F105))","v":0.65},0,0,0,0,{"$f":"IF(OR($B$22=constants!$B$60,AND(I105>$B$12,$B$12<>-1)),O104+(N105-O104)*$O$74,O104+(L105-O104)*$O$74)","v":0},0,0,0,0,0,0,0,0,0,0,0,0]
[1,0.3000000000000001,0.85215655370480814,0.65,3.0874999999997108,3.1025,3.0574999999997137,3.0724999999999998,{"$f":"IF($B$7=constants!$C$60,G106,IF($B$8=constants!$C$60,C106,E106))","v":0.85215655370480814},{"$f":"IF($B$7=constants!$C$60,H106,IF($B$8=constants!$C$60,D106,F106))","v":0.65},0,0,0,0,{"$f":"IF(OR($B$22=constants!$B$60,AND(I106>$B$12,$B$12<>-1)),O105+(N106-O105)*$O$74,O105+(L106-O105)*$O$74)","v":0},0,0,0,0,0,0,0,0,0,0,0,0]
[1,0.31000000000000011,0.86841524559548144,0.65,3.0874999999998938,3.1025,3.0564999999998945,3.0714999999999999,{"$f":"IF($B$7=constants!$C$60,G107,IF($B$8=constants!$C$60,C107,E107))","v":0.86841524559548144},{"$f":"IF($B$7=constants!$C$60,H107,IF($B$8=constants!$C$60,D107,F107))","v":0.65},0,0,0,0,{"$f":"IF(OR($B$22=constants!$B$60,AND(I107>$B$12,$B$12<>-1)),O106+(N107-O106)*$O$74,O106+(L107-O106)*$O$74)","v":0},0,0,0,0,0,0,0,0,0,0,0,0]
[1,0.32000000000000012,0.88414091416491691,0.65,{"$f":"($F$76-$F$74)/(1-EXP(-1/E$74))*(1-EXP(-$B108/E$74))","v":3.0874999999999608},3.1025,{"$f":"(H108-$H$74)/(1-EXP(-1/G$74))*(1-EXP(-$B108/G$74))","v":3.0554999999999612},3.0705,{"$f":"IF($B$7=constants!$C$60,G108,IF($B$8=constants!$C$60,C108,E108))","v":0.88414091416491691},{"$f":"IF($B$7=constants!$C$60,H108,IF($B$8=constants!$C$60,D108,F108))","v":0.65},0,0,0,0,{"$f":"IF(OR($B$22=constants!$B$60,AND(I108>$B$12,$B$12<>-1)),O107+(N108-O107)*$O$74,O107+(L108-O107)*$O$74)","v":0},0,0,0,0,0,0,0,0,0,0,0,0]
[1,0.33000000000000013,{"$f":"$B$18/(1-EXP(-1/$C$74))*(1-EXP(-B109/$C$74))","v":0.89935103399611893},0.65,3.0874999999999857,3.1025,3.0544999999999858,{"$f":"$H$68*B109+$H$69","v":3.0695000000000001},{"$f":"IF($B$7=constants!$C$60,G109,IF($B$8=constants!$C$60,C109,E109))","v":0.89935103399611893},{"$f":"IF($B$7=constants!$C$60,H109,IF($B$8=constants!$C$60,D109,F109))","v":0.65},0,0,0,0,{"$f":"IF(OR($B$22=constants!$B$60,AND(I109>$B$12,$B$12<>-1)),O108+(N109-O108)*$O$74,O108+(L109-O108)*$O$74)","v":0},0,0,0,0,0,0,0,0,0,0,0,0]
[1,0.34000000000000014,0.91406250678711809,0.65,3.0874999999999946,3.1025,3.0534999999999948,3.0684999999999998,{"$f":"IF($B$7=constants!$C$60,G110,IF($B$8=constants!$C$60,C110,E110))","v":0.91406250678711809},{"$f":"IF($B$7=constants!$C$60,H110,IF($B$8=constants!$C$60,D110,F110))","v":0.65},0,0,0,0,{"$f":"IF(OR($B$22=constants!$B$60,AND(I110>$B$12,$B$12<>-1)),O109+(N110-O109)*$O$74,O109+(L110-O109)*$O$74)","v":0},0,0,0,0,0,0,0,0,0,0,0,0]
[1,0.35000000000000014,0.9282916801323754,0.65,3.0874999999999977,3.1025,3.0524999999999975,3.0674999999999999,{"$f":"IF($B$7=constants!$C$60,G111,IF($B$8=constants!$C$60,C111,E111))","v":0.9282916801323754},{"$f":"IF($B$7=constants!$C$60,H111,IF($B$8=constants!$C$60,D111,F111))","v":0.65},0,0,0,0,{"$f":"IF(OR($B$22=constants!$B$60,AND(I111>$B$12,$B$12<>-1)),O110+(N111-O110)*$O$74,O110+(L111-O110)*$O$74)","v":0},0,0,0,0,0,0,0,0,0,0,0,0]
[1,0.36000000000000015,0.94205436568845757,0.65,3.087499999999999,3.1025,3.051499999999999,3.0665,{"$f":"IF($B$7=constants!$C$60,G112,IF($B$8=constants!$C$60,C112,E112))","v":0.94205436568845757},{"$f":"IF($B$7=constants!$C$60,H112,IF($B$8=constants!$C$60,D112,F112))","v":0.65},0,0,0,0,{"$f":"IF(OR($B$22=constants!$B$60,AND(I112>$B$12,$B$12<>-1)),O111+(N112-O111)*$O$74,O111+(L112-O111)*$O$74)","v":0},0,0,0,0,0,0,0,0,0,0,0,0]
[1,0.37000000000000016,0.95536585674417152,0.65,3.0874999999999995,3.1025,3.0504999999999995,3.0655000000000001,{"$f":"IF($B$7=constants!$C$60,G113,IF($B$8=constants!$C$60,C113,E113))","v":0.95536585674417152},{"$f":"IF($B$7=constants!$C$60,H113,IF($B$8=constants!$C$60,D113,F113))","v":0.65},0,0,0,0,{"$f":"IF(OR($B$22=constants!$B$60,AND(I113>$B$12,$B$12<>-1)),O112+(N113-O112)*$O$74,O112+(L113-O112)*$O$74)","v":0},0,0,0,0,0,0,0,0,0,0,0,0]
[1,0.38000000000000017,0.9682409452146804,0.65,3.0874999999999999,3.1025,3.0494999999999997,3.0644999999999998,{"$f":"IF($B$7=constants!$C$60,G114,IF($B$8=constants!$C$60,C114,E114))","v":0.9682409452146804},{"$f":"IF($B$7=constants!$C$60,H114,IF($B$8=constants!$C$60,D114,F114))","v":0.65},0,0,0,0,{"$f":"IF(OR($B$22=constants!$B$60,AND(I114>$B$12,$B$12<>-1)),O113+(N114-O113)*$O$74,O113+(L114-O113)*$O$74)","v":0},0,0,0,0,0,0,0,0,0,0,0,0]
[1,0.39000000000000018,0.98069393807848659,0.65,3.0874999999999999,3.1025,3.0484999999999998,3.0634999999999999,{"$f":"IF($B$7=constants!$C$60,G115,IF($B$8=constants!$C$60,C115,E115))","v":0.98069393807848659},{"$f":"IF($B$7=constants!$C$60,H115,IF($B$8=constants!$C$60,D115,F115))","v":0.65},0,0,0,0,{"$f":"IF(OR($B$22=constants!$B$60,AND(I115>$B$12,$B$12<>-1)),O114+(N115-O114)*$O$74,O114+(L115-O114)*$O$74)","v":0},0,0,0,0,0,0,0,0,0,0,0,0]
[1,0.40000000000000019,0.99273867327554755,0.65,3.0874999999999999,3.1025,3.0474999999999999,3.0625,{"$f":"IF($B$7=constants!$C$60,G116,IF($B$8=constants!$C$60,C116,E116))","v":0.99273867327554755},{"$f":"IF($B$7=constants!$C$60,H116,IF($B$8=constants!$C$60,D116,F116))","v":0.65},0,0,0,0,{"$f":"IF(OR($B$22=constants!$B$60,AND(I116>$B$12,$B$12<>-1)),O115+(N116-O115)*$O$74,O115+(L116-O115)*$O$74)","v":0},0,0,0,0,0,0,0,0,0,0,0,0]
[1,0.4100000000000002,1.0043885350841872,0.65,3.0874999999999999,3.1025,3.0465,3.0615000000000001,{"$f":"IF($B$7=constants!$C$60,G117,IF($B$8=constants!$C$60,C117,E117))","v":1.0043885350841872},{"$f":"IF($B$7=constants!$C$60,H117,IF($B$8=constants!$C$60,D117,F117))","v":0.65},0,0,0,0,{"$f":"IF(OR($B$22=constants!$B$60,AND(I117>$B$12,$B$12<>-1)),O116+(N117-O116)*$O$74,O116+(L117-O116)*$O$74)","v":0},0,0,0,0,0,0,0,0,0,0,0,0]
[1,0.42000000000000021,1.0156564689938941,0.65,3.0874999999999999,{"$f":"F117","v":3.1025},3.0454999999999997,3.0604999999999998,{"$f":"IF($B$7=constants!$C$60,G118,IF($B$8=constants!$C$60,C118,E118))","v":1.0156564689938941},{"$f":"IF($B$7=constants!$C$60,H118,IF($B$8=constants!$C$60,D118,F118))","v":0.65},0,0,0,0,{"$f":"IF(OR($B$22=constants!$B$60,AND(I118>$B$12,$B$12<>-1)),O117+(N118-O117)*$O$74,O117+(L118-O117)*$O$74)","v":0},0,0,0,0,0,0,0,0,0,0,0,0]
[1,0.43000000000000022,1.0265549960905294,0.65,3.0874999999999999,3.1025,3.0444999999999998,3.0594999999999999,{"$f":"IF($B$7=constants!$C$60,G119,IF($B$8=constants!$C$60,C119,E119))","v":1.0265549960905294},{"$f":"IF($B$7=constants!$C$60,H119,IF($B$8=constants!$C$60,D119,F119))","v":0.65},0,0,0,0,{"$f":"IF(OR($B$22=constants!$B$60,AND(I119>$B$12,$B$12<>-1)),O118+(N119-O118)*$O$74,O118+(L119-O118)*$O$74)","v":0},0,0,0,0,0,0,0,0,0,0,0,0]
[1,0.44000000000000022,1.0370962269699346,0.65,3.0874999999999999,3.1025,3.0434999999999999,3.0585,{"$f":"IF($B$7=constants!$C$60,G120,IF($B$8=constants!$C$60,C120,E120))","v":1.0370962269699346},{"$f":"IF($B$7=constants!$C$60,H120,IF($B$8=constants!$C$60,D120,F120))","v":0.65},0,0,0,0,{"$f":"IF(OR($B$22=constants!$B$60,AND(I120>$B$12,$B$12<>-1)),O119+(N120-O119)*$O$74,O119+(L120-O119)*$O$74)","v":0},0,0,0,0,0,0,0,0,0,0,0,0]
[1,0.45000000000000023,1.0472918751953935,0.65,3.0874999999999999,3.1025,3.0425,3.0575000000000001,{"$f":"IF($B$7=constants!$C$60,G121,IF($B$8=constants!$C$60,C121,E121))","v":1.0472918751953935},{"$f":"IF($B$7=constants!$C$60,H121,IF($B$8=constants!$C$60,D121,F121))","v":0.65},0,0,0,0,{"$f":"IF(OR($B$22=constants!$B$60,AND(I121>$B$12,$B$12<>-1)),O120+(N121-O120)*$O$74,O120+(L121-O120)*$O$74)","v":0},0,0,0,0,0,0,0,0,0,0,0,0]
[1,0.46000000000000024,1.0571532703139082,0.65,3.0874999999999999,3.1025,3.0414999999999996,3.0564999999999998,{"$f":"IF($B$7=constants!$C$60,G122,IF($B$8=constants!$C$60,C122,E122))","v":1.0571532703139082},{"$f":"IF($B$7=constants!$C$60,H122,IF($B$8=constants!$C$60,D122,F122))","v":0.65},0,0,0,0,{"$f":"IF(OR($B$22=constants!$B$60,AND(I122>$B$12,$B$12<>-1)),O121+(N122-O121)*$O$74,O121+(L122-O121)*$O$74)","v":0},0,0,0,0,0,0,0,0,0,0,0,0]
[1,0.47000000000000025,1.0666913704457499,0.65,3.0874999999999999,3.1025,3.0404999999999998,3.0554999999999999,{"$f":"IF($B$7=constants!$C$60,G123,IF($B$8=constants!$C$60,C123,E123))","v":1.0666913704457499},{"$f":"IF($B$7=constants!$C$60,H123,IF($B$8=constants!$C$60,D123,F123))","v":0.65},0,0,0,0,{"$f":"IF(OR($B$22=constants!$B$60,AND(I123>$B$12,$B$12<>-1)),O122+(N123-O122)*$O$74,O122+(L123-O122)*$O$74)","v":0},0,0,0,0,0,0,0,0,0,0,0,0]
[1,0.48000000000000026,1.0759167744612772,0.65,3.0874999999999999,3.1025,3.0394999999999999,3.0545,{"$f":"IF($B$7=constants!$C$60,G124,IF($B$8=constants!$C$60,C124,E124))","v":1.0759167744612772},{"$f":"IF($B$7=constants!$C$60,H124,IF($B$8=constants!$C$60,D124,F124))","v":0.65},0,0,0,0,{"$f":"IF(OR($B$22=constants!$B$60,AND(I124>$B$12,$B$12<>-1)),O123+(N124-O123)*$O$74,O123+(L124-O123)*$O$74)","v":0},0,0,0,0,0,0,0,0,0,0,0,0]
[1,0.49000000000000027,1.0848397337585463,0.65,3.0874999999999999,3.1025,3.0385,3.0535000000000001,{"$f":"IF($B$7=constants!$C$60,G125,IF($B$8=constants!$C$60,C125,E125))","v":1.0848397337585463},{"$f":"IF($B$7=constants!$C$60,H125,IF($B$8=constants!$C$60,D125,F125))","v":0.65},0,0,0,0,{"$f":"IF(OR($B$22=constants!$B$60,AND(I125>$B$12,$B$12<>-1)),O124+(N125-O124)*$O$74,O124+(L125-O124)*$O$74)","v":0},0,0,0,0,0,0,0,0,0,0,0,0]
[1,0.50000000000000022,1.0934701636548105,0.65,3.0874999999999999,3.1025,3.0374999999999996,3.0524999999999998,{"$f":"IF($B$7=constants!$C$60,G126,IF($B$8=constants!$C$60,C126,E126))","v":1.0934701636548105},{"$f":"IF($B$7=constants!$C$60,H126,IF($B$8=constants!$C$60,D126,F126))","v":0.65},0,0,0,0,{"$f":"IF(OR($B$22=constants!$B$60,AND(I126>$B$12,$B$12<>-1)),O125+(N126-O125)*$O$74,O125+(L126-O125)*$O$74)","v":0},0,0,0,0,0,0,0,0,0,0,0,0]
[1,0.51000000000000023,1.1018176544045588,0.65,3.0874999999999999,3.1025,3.0364999999999998,3.0514999999999999,{"$f":"IF($B$7=constants!$C$60,G127,IF($B$8=constants!$C$60,C127,E127))","v":1.1018176544045588},{"$f":"IF($B$7=constants!$C$60,H127,IF($B$8=constants!$C$60,D127,F127))","v":0.65},0,0,0,0,{"$f":"IF(OR($B$22=constants!$B$60,AND(I127>$B$12,$B$12<>-1)),O126+(N127-O126)*$O$74,O126+(L127-O126)*$O$74)","v":0},0,0,0,0,0,0,0,0,0,0,0,0]
[1,0.52000000000000024,1.1098914818563397,0.65,3.0874999999999999,3.1025,3.0354999999999999,3.0505,{"$f":"IF($B$7=constants!$C$60,G128,IF($B$8=constants!$C$60,C128,E128))","v":1.1098914818563397},{"$f":"IF($B$7=constants!$C$60,H128,IF($B$8=constants!$C$60,D128,F128))","v":0.65},0,0,0,0,{"$f":"IF(OR($B$22=constants!$B$60,AND(I128>$B$12,$B$12<>-1)),O127+(N128-O127)*$O$74,O127+(L128-O127)*$O$74)","v":0},0,0,0,0,0,0,0,0,0,0,0,0]
[1,0.53000000000000025,1.1177006177602158,0.65,3.0874999999999999,3.1025,3.0345,3.0495000000000001,{"$f":"IF($B$7=constants!$C$60,G129,IF($B$8=constants!$C$60,C129,E129))","v":1.1177006177602158},{"$f":"IF($B$7=constants!$C$60,H129,IF($B$8=constants!$C$60,D129,F129))","v":0.65},0,0,0,0,{"$f":"IF(OR($B$22=constants!$B$60,AND(I129>$B$12,$B$12<>-1)),O128+(N129-O128)*$O$74,O128+(L129-O128)*$O$74)","v":0},0,0,0,0,0,0,0,0,0,0,0,0]
[1,0.54000000000000026,1.1252537397372968,0.65,3.0874999999999999,3.1025,3.0334999999999996,3.0484999999999998,{"$f":"IF($B$7=constants!$C$60,G130,IF($B$8=constants!$C$60,C130,E130))","v":1.1252537397372968},{"$f":"IF($B$7=constants!$C$60,H130,IF($B$8=constants!$C$60,D130,F130))","v":0.65},0,0,0,0,{"$f":"IF(OR($B$22=constants!$B$60,AND(I130>$B$12,$B$12<>-1)),O129+(N130-O129)*$O$74,O129+(L130-O129)*$O$74)","v":0},0,0,0,0,0,0,0,0,0,0,0,0]
[1,0.55000000000000027,1.1325592409224345,0.65,3.0874999999999999,3.1025,3.0324999999999998,3.0474999999999999,{"$f":"IF($B$7=constants!$C$60,G131,IF($B$8=constants!$C$60,C131,E131))","v":1.1325592409224345},{"$f":"IF($B$7=constants!$C$60,H131,IF($B$8=constants!$C$60,D131,F131))","v":0.65},0,0,0,0,{"$f":"IF(OR($B$22=constants!$B$60,AND(I131>$B$12,$B$12<>-1)),O130+(N131-O130)*$O$74,O130+(L131-O130)*$O$74)","v":0},0,0,0,0,0,0,0,0,0,0,0,0]
[1,0.56000000000000028,1.1396252392907895,0.65,3.0874999999999999,3.1025,3.0314999999999999,3.0465,{"$f":"IF($B$7=constants!$C$60,G132,IF($B$8=constants!$C$60,C132,E132))","v":1.1396252392907895},{"$f":"IF($B$7=constants!$C$60,H132,IF($B$8=constants!$C$60,D132,F132))","v":0.65},0,0,0,0,{"$f":"IF(OR($B$22=constants!$B$60,AND(I132>$B$12,$B$12<>-1)),O131+(N132-O131)*$O$74,O131+(L132-O131)*$O$74)","v":0},0,0,0,0,0,0,0,0,0,0,0,0]
[1,0.57000000000000028,1.1464595866786425,0.65,3.0874999999999999,3.1025,3.0305,3.0455000000000001,{"$f":"IF($B$7=constants!$C$60,G133,IF($B$8=constants!$C$60,C133,E133))","v":1.1464595866786425},{"$f":"IF($B$7=constants!$C$60,H133,IF($B$8=constants!$C$60,D133,F133))","v":0.65},0,0,0,0,{"$f":"IF(OR($B$22=constants!$B$60,AND(I133>$B$12,$B$12<>-1)),O132+(N133-O132)*$O$74,O132+(L133-O132)*$O$74)","v":0},0,0,0,0,0,0,0,0,0,0,0,0]
[1,0.58000000000000029,1.1530698775084607,0.65,3.0874999999999999,3.1025,3.0294999999999996,3.0444999999999998,{"$f":"IF($B$7=constants!$C$60,G134,IF($B$8=constants!$C$60,C134,E134))","v":1.1530698775084607},{"$f":"IF($B$7=constants!$C$60,H134,IF($B$8=constants!$C$60,D134,F134))","v":0.65},0,0,0,0,{"$f":"IF(OR($B$22=constants!$B$60,AND(I134>$B$12,$B$12<>-1)),O133+(N134-O133)*$O$74,O133+(L134-O133)*$O$74)","v":0},0,0,0,0,0,0,0,0,0,0,0,0]
[1,0.5900000000000003,1.1594634572279294,0.65,3.0874999999999999,3.1025,3.0284999999999997,3.0434999999999999,{"$f":"IF($B$7=constants!$C$60,G135,IF($B$8=constants!$C$60,C135,E135))","v":1.1594634572279294},{"$f":"IF($B$7=constants!$C$60,H135,IF($B$8=constants!$C$60,D135,F135))","v":0.65},0,0,0,0,{"$f":"IF(OR($B$22=constants!$B$60,AND(I135>$B$12,$B$12<>-1)),O134+(N135-O134)*$O$74,O134+(L135-O134)*$O$74)","v":0},0,0,0,0,0,0,0,0,0,0,0,0]
[1,0.60000000000000031,1.165647430472315,0.65,3.0874999999999999,3.1025,3.0274999999999999,3.0425,{"$f":"IF($B$7=constants!$C$60,G136,IF($B$8=constants!$C$60,C136,E136))","v":1.165647430472315},{"$f":"IF($B$7=constants!$C$60,H136,IF($B$8=constants!$C$60,D136,F136))","v":0.65},0,0,0,0,{"$f":"IF(OR($B$22=constants!$B$60,AND(I136>$B$12,$B$12<>-1)),O135+(N136-O135)*$O$74,O135+(L136-O135)*$O$74)","v":0},0,0,0,0,0,0,0,0,0,0,0,0]
[1,0.61000000000000032,1.1716286689592346,0.65,3.0874999999999999,3.1025,3.0265,3.0415000000000001,{"$f":"IF($B$7=constants!$C$60,G137,IF($B$8=constants!$C$60,C137,E137))","v":1.1716286689592346},{"$f":"IF($B$7=constants!$C$60,H137,IF($B$8=constants!$C$60,D137,F137))","v":0.65},0,0,0,0,{"$f":"IF(OR($B$22=constants!$B$60,AND(I137>$B$12,$B$12<>-1)),O136+(N137-O136)*$O$74,O136+(L137-O136)*$O$74)","v":0},0,0,0,0,0,0,0,0,0,0,0,0]
[1,0.62000000000000033,1.177413819124606,0.65,3.0874999999999999,3.1025,3.0254999999999996,3.0404999999999998,{"$f":"IF($B$7=constants!$C$60,G138,IF($B$8=constants!$C$60,C138,E138))","v":1.177413819124606},{"$f":"IF($B$7=constants!$C$60,H138,IF($B$8=constants!$C$60,D138,F138))","v":0.65},0,0,0,0,{"$f":"IF(OR($B$22=constants!$B$60,AND(I138>$B$12,$B$12<>-1)),O137+(N138-O137)*$O$74,O137+(L138-O137)*$O$74)","v":0},0,0,0,0,0,0,0,0,0,0,0,0]
[1,0.63000000000000034,1.183009309508259,0.65,3.0874999999999999,3.1025,3.0244999999999997,3.0394999999999999,{"$f":"IF($B$7=constants!$C$60,G139,IF($B$8=constants!$C$60,C139,E139))","v":1.183009309508259},{"$f":"IF($B$7=constants!$C$60,H139,IF($B$8=constants!$C$60,D139,F139))","v":0.65},0,0,0,0,{"$f":"IF(OR($B$22=constants!$B$60,AND(I139>$B$12,$B$12<>-1)),O138+(N139-O138)*$O$74,O138+(L139-O138)*$O$74)","v":0},0,0,0,0,0,0,0,0,0,0,0,0]
[1,0.64000000000000035,1.1884213578974208,0.65,{"$f":"($F$76-$F$74)/(1-EXP(-1/E$74))*(1-EXP(-$B140/E$74))","v":3.0874999999999999},3.1025,{"$f":"(H140-$H$74)/(1-EXP(-1/G$74))*(1-EXP(-$B140/G$74))","v":3.0234999999999999},3.0385,{"$f":"IF($B$7=constants!$C$60,G140,IF($B$8=constants!$C$60,C140,E140))","v":1.1884213578974208},{"$f":"IF($B$7=constants!$C$60,H140,IF($B$8=constants!$C$60,D140,F140))","v":0.65},0,0,0,0,{"$f":"IF(OR($B$22=constants!$B$60,AND(I140>$B$12,$B$12<>-1)),O139+(N140-O139)*$O$74,O139+(L140-O139)*$O$74)","v":0},0,0,0,0,0,0,0,0,0,0,0,0]
[{"$f":"IF(B141<=100,1,IF(B141<=200,2,3))","v":1},0.65000000000000036,{"$f":"$B$18/(1-EXP(-1/$C$74))*(1-EXP(-B141/$C$74))","v":1.1936559782360057},0.65,3.0874999999999999,3.1025,3.0225,{"$f":"$H$68*B141+$H$69","v":3.0375000000000001},{"$f":"IF($B$7=constants!$C$60,G141,IF($B$8=constants!$C$60,C141,E141))","v":1.1936559782360057},{"$f":"IF($B$7=constants!$C$60,H141,IF($B$8=constants!$C$60,D141,F141))","v":0.65},0,0,0,{"$f":"IF(M141>I141,L141,M141)","v":0},{"$f":"IF(OR($B$22=constants!$B$60,AND(I141>$B$12,$B$12<>-1)),O140+(N141-O140)*$O$74,O140+(L141-O140)*$O$74)","v":0},{"$f":"IF(O141=0,0,O141-$P$72)","v":0},0,0,{"$f":"S$72*IF(S$71=0,$L141,IF(S$71=1,$R141,IF($B$12=-1,$L141,IF($I141>$B$12,$R141,$L141))))","v":0},0,0,0,0,0,{"$f":"IF(V141=0,0,V141-Y$72)","v":0},{"$f":"IF(W141=0,0,W141-Z$72)","v":0},{"$f":"IF(X141=0,0,X141-AA$72)","v":0}]
[1,{"$f":"B141+0.01","v":0.66000000000000036},1.1987189873073956,{"$f":"D141","v":0.65},3.0874999999999999,3.1025,3.0214999999999996,3.0364999999999998,{"$f":"IF($B$7=constants!$C$60,G142,IF($B$8=constants!$C$60,C142,E142))","v":1.1987189873073956},{"$f":"IF($B$7=constants!$C$60,H142,IF($B$8=constants!$C$60,D142,F142))","v":0.65},{"$f":"IF(AND(I142>$B$16,K141=0),1,IF(AND(I142<$B$17,K141=1),0,K141))","v":0},0,0,0,{"$f":"IF(OR($B$22=constants!$B$60,AND(I142>$B$12,$B$12<>-1)),O141+(N142-O141)*$O$74,O141+(L142-O141)*$O$74)","v":0},0,0,{"$f":"IF(Q142>I142,I142,Q142)","v":0},0,0,0,{"$f":"V141+(S142-V$72-V141)*V$74","v":0},{"$f":"W141+(T142-W$72-W141)*W$74","v":0},{"$f":"X141+(U142-X$72-X141)*X$74","v":0},0,0,0]
[1,0.67000000000000037,1.20361601119813,0.65,3.0874999999999999,3.1025,3.0204999999999997,3.0354999999999999,{"$f":"IF($B$7=constants!$C$60,G143,IF($B$8=constants!$C$60,C143,E143))","v":1.20361601119813},{"$f":"IF($B$7=constants!$C$60,H143,IF($B$8=constants!$C$60,D143,F143))","v":0.65},0,0,0,0,{"$f":"IF(OR($B$22=constants!$B$60,AND(I143>$B$12,$B$12<>-1)),O142+(N143-O142)*$O$74,O142+(L143-O142)*$O$74)","v":0},0,0,0,0,0,0,0,0,0,0,0,0]
[1,0.68000000000000038,1.2083524915496937,0.65,3.0874999999999999,3.1025,3.0194999999999999,3.0345,{"$f":"IF($B$7=constants!$C$60,G144,IF($B$8=constants!$C$60,C144,E144))","v":1.2083524915496937},{"$f":"IF($B$7=constants!$C$60,H144,IF($B$8=constants!$C$60,D144,F144))","v":0.65},0,0,0,0,{"$f":"IF(OR($B$22=constants!$B$60,AND(I144>$B$12,$B$12<>-1)),O143+(N144-O143)*$O$74,O143+(L144-O143)*$O$74)","v":0},0,0,0,0,0,0,0,0,0,0,0,0]
[1,0.69000000000000039,1.2129336916053428,0.65,3.0874999999999999,3.1025,3.0185,3.0335000000000001,{"$f":"IF($B$7=constants!$C$60,G145,IF($B$8=constants!$C$60,C145,E145))","v":1.2129336916053428},{"$f":"IF($B$7=constants!$C$60,H145,IF($B$8=constants!$C$60,D145,F145))","v":0.65},0,0,0,0,{"$f":"IF(OR($B$22=constants!$B$60,AND(I145>$B$12,$B$12<>-1)),O144+(N145-O144)*$O$74,O144+(L145-O144)*$O$74)","v":0},0,0,0,0,0,0,0,0,0,0,0,0]
[1,0.7000000000000004,1.2173647020586955,0.65,3.0874999999999999,3.1025,3.0174999999999996,3.0324999999999998,{"$f":"IF($B$7=constants!$C$60,G146,IF($B$8=constants!$C$60,C146,E146))","v":1.2173647020586955},{"$f":"IF($B$7=constants!$C$60,H146,IF($B$8=constants!$C$60,D146,F146))","v":0.65},0,0,0,0,{"$f":"IF(OR($B$22=constants!$B$60,AND(I146>$B$12,$B$12<>-1)),O145+(N146-O145)*$O$74,O145+(L146-O145)*$O$74)","v":0},0,0,0,0,0,0,0,0,0,0,0,0]
[1,0.71000000000000041,1.2216504467105824,0.65,3.0874999999999999,3.1025,3.0164999999999997,3.0314999999999999,{"$f":"IF($B$7=constants!$C$60,G147,IF($B$8=constants!$C$60,C147,E147))","v":1.2216504467105824},{"$f":"IF($B$7=constants!$C$60,H147,IF($B$8=constants!$C$60,D147,F147))","v":0.65},0,0,0,0,{"$f":"IF(OR($B$22=constants!$B$60,AND(I147>$B$12,$B$12<>-1)),O146+(N147-O146)*$O$74,O146+(L147-O146)*$O$74)","v":0},0,0,0,0,0,0,0,0,0,0,0,0]
[1,0.72000000000000042,1.2257956879404421,0.65,3.0874999999999999,3.1025,3.0154999999999998,3.0305,{"$f":"IF($B$7=constants!$C$60,G148,IF($B$8=constants!$C$60,C148,E148))","v":1.2257956879404421},{"$f":"IF($B$7=constants!$C$60,H148,IF($B$8=constants!$C$60,D148,F148))","v":0.65},0,0,0,0,{"$f":"IF(OR($B$22=constants!$B$60,AND(I148>$B$12,$B$12<>-1)),O147+(N148-O147)*$O$74,O147+(L148-O147)*$O$74)","v":0},0,0,0,0,0,0,0,0,0,0,0,0]
[1,0.73000000000000043,1.229805031998344,0.65,3.0874999999999999,3.1025,3.0145,3.0295000000000001,{"$f":"IF($B$7=constants!$C$60,G149,IF($B$8=constants!$C$60,C149,E149))","v":1.229805031998344},{"$f":"IF($B$7=constants!$C$60,H149,IF($B$8=constants!$C$60,D149,F149))","v":0.65},0,0,0,0,{"$f":"IF(OR($B$22=constants!$B$60,AND(I149>$B$12,$B$12<>-1)),O148+(N149-O148)*$O$74,O148+(L149-O148)*$O$74)","v":0},0,0,0,0,0,0,0,0,0,0,0,0]
[1,0.74000000000000044,1.2336829341235187,0.65,3.0874999999999999,3.1025,3.0134999999999996,3.0284999999999997,{"$f":"IF($B$7=constants!$C$60,G150,IF($B$8=constants!$C$60,C150,E150))","v":1.2336829341235187},{"$f":"IF($B$7=constants!$C$60,H150,IF($B$8=constants!$C$60,D150,F150))","v":0.65},0,0,0,0,{"$f":"IF(OR($B$22=constants!$B$60,AND(I150>$B$12,$B$12<>-1)),O149+(N150-O149)*$O$74,O149+(L150-O149)*$O$74)","v":0},0,0,0,0,0,0,0,0,0,0,0,0]
[1,0.75000000000000044,1.2374337034950813,0.65,3.0874999999999999,3.1025,3.0124999999999997,3.0274999999999999,{"$f":"IF($B$7=constants!$C$60,G151,IF($B$8=constants!$C$60,C151,E151))","v":1.2374337034950813},{"$f":"IF($B$7=constants!$C$60,H151,IF($B$8=constants!$C$60,D151,F151))","v":0.65},0,0,0,0,{"$f":"IF(OR($B$22=constants!$B$60,AND(I151>$B$12,$B$12<>-1)),O150+(N151-O150)*$O$74,O150+(L151-O150)*$O$74)","v":0},0,0,0,0,0,0,0,0,0,0,0,0]
[1,0.76000000000000045,1.2410615080204512,0.65,3.0874999999999999,3.1025,3.0114999999999998,3.0265,{"$f":"IF($B$7=constants!$C$60,G152,IF($B$8=constants!$C$60,C152,E152))","v":1.2410615080204512},{"$f":"IF($B$7=constants!$C$60,H152,IF($B$8=constants!$C$60,D152,F152))","v":0.65},0,0,0,0,{"$f":"IF(OR($B$22=constants!$B$60,AND(I152>$B$12,$B$12<>-1)),O151+(N152-O151)*$O$74,O151+(L152-O151)*$O$74)","v":0},0,0,0,0,0,0,0,0,0,0,0,0]
[1,0.77000000000000046,1.2445703789667903,0.65,3.0874999999999999,3.1025,3.0105,3.0255000000000001,{"$f":"IF($B$7=constants!$C$60,G153,IF($B$8=constants!$C$60,C153,E153))","v":1.2445703789667903},{"$f":"IF($B$7=constants!$C$60,H153,IF($B$8=constants!$C$60,D153,F153))","v":0.65},0,0,0,0,{"$f":"IF(OR($B$22=constants!$B$60,AND(I153>$B$12,$B$12<>-1)),O152+(N153-O152)*$O$74,O152+(L153-O152)*$O$74)","v":0},0,0,0,0,0,0,0,0,0,0,0,0]
[1,0.78000000000000047,1.2479642154406034,0.65,3.0874999999999999,3.1025,3.0094999999999996,3.0244999999999997,{"$f":"IF($B$7=constants!$C$60,G154,IF($B$8=constants!$C$60,C154,E154))","v":1.2479642154406034},{"$f":"IF($B$7=constants!$C$60,H154,IF($B$8=constants!$C$60,D154,F154))","v":0.65},0,0,0,0,{"$f":"IF(OR($B$22=constants!$B$60,AND(I154>$B$12,$B$12<>-1)),O153+(N154-O153)*$O$74,O153+(L154-O153)*$O$74)","v":0},0,0,0,0,0,0,0,0,0,0,0,0]
[1,0.79000000000000048,1.2512467887204783,0.65,3.0874999999999999,3.1025,3.0084999999999997,3.0234999999999999,{"$f":"IF($B$7=constants!$C$60,G155,IF($B$8=constants!$C$60,C155,E155))","v":1.2512467887204783},{"$f":"IF($B$7=constants!$C$60,H155,IF($B$8=constants!$C$60,D155,F155))","v":0.65},0,0,0,0,{"$f":"IF(OR($B$22=constants!$B$60,AND(I155>$B$12,$B$12<>-1)),O154+(N155-O154)*$O$74,O154+(L155-O154)*$O$74)","v":0},0,0,0,0,0,0,0,0,0,0,0,0]
[1,0.80000000000000049,1.2544217464477854,0.65,3.0874999999999999,3.1025,3.0074999999999998,3.0225,{"$f":"IF($B$7=constants!$C$60,G156,IF($B$8=constants!$C$60,C156,E156))","v":1.2544217464477854},{"$f":"IF($B$7=constants!$C$60,H156,IF($B$8=constants!$C$60,D156,F156))","v":0.65},0,0,0,0,{"$f":"IF(OR($B$22=constants!$B$60,AND(I156>$B$12,$B$12<>-1)),O155+(N156-O155)*$O$74,O155+(L156-O155)*$O$74)","v":0},0,0,0,0,0,0,0,0,0,0,0,0]
[1,0.8100000000000005,1.2574926166799865,0.65,3.0874999999999999,3.1025,3.0065,3.0215000000000001,{"$f":"IF($B$7=constants!$C$60,G157,IF($B$8=constants!$C$60,C157,E157))","v":1.2574926166799865},{"$f":"IF($B$7=constants!$C$60,H157,IF($B$8=constants!$C$60,D157,F157))","v":0.65},0,0,0,0,{"$f":"IF(OR($B$22=constants!$B$60,AND(I157>$B$12,$B$12<>-1)),O156+(N157-O156)*$O$74,O156+(L157-O156)*$O$74)","v":0},0,0,0,0,0,0,0,0,0,0,0,0]
[1,0.82000000000000051,1.2604628118110623,0.65,3.0874999999999999,3.1025,3.0054999999999996,3.0204999999999997,{"$f":"IF($B$7=constants!$C$60,G158,IF($B$8=constants!$C$60,C158,E158))","v":1.2604628118110623},{"$f":"IF($B$7=constants!$C$60,H158,IF($B$8=constants!$C$60,D158,F158))","v":0.65},0,0,0,0,{"$f":"IF(OR($B$22=constants!$B$60,AND(I158>$B$12,$B$12<>-1)),O157+(N158-O157)*$O$74,O157+(L158-O157)*$O$74)","v":0},0,0,0,0,0,0,0,0,0,0,0,0]
[1,0.83000000000000052,1.2633356323634122,0.65,3.0874999999999999,3.1025,3.0044999999999997,3.0194999999999999,{"$f":"IF($B$7=constants!$C$60,G159,IF($B$8=constants!$C$60,C159,E159))","v":1.2633356323634122},{"$f":"IF($B$7=constants!$C$60,H159,IF($B$8=constants!$C$60,D159,F159))","v":0.65},0,0,0,0,{"$f":"IF(OR($B$22=constants!$B$60,AND(I159>$B$12,$B$12<>-1)),O158+(N159-O158)*$O$74,O158+(L159-O158)*$O$74)","v":0},0,0,0,0,0,0,0,0,0,0,0,0]
[1,0.84000000000000052,1.2661142706554405,0.65,3.0874999999999999,3.1025,3.0034999999999998,3.0185,{"$f":"IF($B$7=constants!$C$60,G160,IF($B$8=constants!$C$60,C160,E160))","v":1.2661142706554405},{"$f":"IF($B$7=constants!$C$60,H160,IF($B$8=constants!$C$60,D160,F160))","v":0.65},0,0,0,0,{"$f":"IF(OR($B$22=constants!$B$60,AND(I160>$B$12,$B$12<>-1)),O159+(N160-O159)*$O$74,O159+(L160-O159)*$O$74)","v":0},0,0,0,0,0,0,0,0,0,0,0,0]
[1,0.85000000000000053,1.2688018143489062,0.65,3.0874999999999999,3.1025,3.0024999999999999,3.0175000000000001,{"$f":"IF($B$7=constants!$C$60,G161,IF($B$8=constants!$C$60,C161,E161))","v":1.2688018143489062},{"$f":"IF($B$7=constants!$C$60,H161,IF($B$8=constants!$C$60,D161,F161))","v":0.65},0,0,0,0,{"$f":"IF(OR($B$22=constants!$B$60,AND(I161>$B$12,$B$12<>-1)),O160+(N161-O160)*$O$74,O160+(L161-O160)*$O$74)","v":0},0,0,0,0,0,0,0,0,0,0,0,0]
[1,0.86000000000000054,1.2714012498799747,0.65,3.0874999999999999,3.1025,3.0014999999999996,3.0164999999999997,{"$f":"IF($B$7=constants!$C$60,G162,IF($B$8=constants!$C$60,C162,E162))","v":1.2714012498799747},{"$f":"IF($B$7=constants!$C$60,H162,IF($B$8=constants!$C$60,D162,F162))","v":0.65},0,0,0,0,{"$f":"IF(OR($B$22=constants!$B$60,AND(I162>$B$12,$B$12<>-1)),O161+(N162-O161)*$O$74,O161+(L162-O161)*$O$74)","v":0},0,0,0,0,0,0,0,0,0,0,0,0]
[1,0.87000000000000055,1.2739154657777896,0.65,3.0874999999999999,3.1025,3.0004999999999997,3.0154999999999998,{"$f":"IF($B$7=constants!$C$60,G163,IF($B$8=constants!$C$60,C163,E163))","v":1.2739154657777896},{"$f":"IF($B$7=constants!$C$60,H163,IF($B$8=constants!$C$60,D163,F163))","v":0.65},0,0,0,0,{"$f":"IF(OR($B$22=constants!$B$60,AND(I163>$B$12,$B$12<>-1)),O162+(N163-O162)*$O$74,O162+(L163-O162)*$O$74)","v":0},0,0,0,0,0,0,0,0,0,0,0,0]
[1,0.88000000000000056,1.2763472558742439,0.65,3.0874999999999999,3.1025,2.9994999999999998,3.0145,{"$f":"IF($B$7=constants!$C$60,G164,IF($B$8=constants!$C$60,C164,E164))","v":1.2763472558742439},{"$f":"IF($B$7=constants!$C$60,H164,IF($B$8=constants!$C$60,D164,F164))","v":0.65},0,0,0,0,{"$f":"IF(OR($B$22=constants!$B$60,AND(I164>$B$12,$B$12<>-1)),O163+(N164-O163)*$O$74,O163+(L164-O163)*$O$74)","v":0},0,0,0,0,0,0,0,0,0,0,0,0]
[1,0.89000000000000057,1.2786993224085272,0.65,3.0874999999999999,3.1025,2.9984999999999999,3.0135000000000001,{"$f":"IF($B$7=constants!$C$60,G165,IF($B$8=constants!$C$60,C165,E165))","v":1.2786993224085272},{"$f":"IF($B$7=constants!$C$60,H165,IF($B$8=constants!$C$60,D165,F165))","v":0.65},0,0,0,0,{"$f":"IF(OR($B$22=constants!$B$60,AND(I165>$B$12,$B$12<>-1)),O164+(N165-O164)*$O$74,O164+(L165-O164)*$O$74)","v":0},0,0,0,0,0,0,0,0,0,0,0,0]
[1,0.90000000000000058,1.2809742790298908,0.65,3.0874999999999999,3.1025,2.9974999999999996,3.0124999999999997,{"$f":"IF($B$7=constants!$C$60,G166,IF($B$8=constants!$C$60,C166,E166))","v":1.2809742790298908},{"$f":"IF($B$7=constants!$C$60,H166,IF($B$8=constants!$C$60,D166,F166))","v":0.65},0,0,0,0,{"$f":"IF(OR($B$22=constants!$B$60,AND(I166>$B$12,$B$12<>-1)),O165+(N166-O165)*$O$74,O165+(L166-O165)*$O$74)","v":0},0,0,0,0,0,0,0,0,0,0,0,0]
[1,0.91000000000000059,1.2831746537019719,0.65,3.0874999999999999,3.1025,2.9964999999999997,3.0114999999999998,{"$f":"IF($B$7=constants!$C$60,G167,IF($B$8=constants!$C$60,C167,E167))","v":1.2831746537019719},{"$f":"IF($B$7=constants!$C$60,H167,IF($B$8=constants!$C$60,D167,F167))","v":0.65},0,0,0,0,{"$f":"IF(OR($B$22=constants!$B$60,AND(I167>$B$12,$B$12<>-1)),O166+(N167-O166)*$O$74,O166+(L167-O166)*$O$74)","v":0},0,0,0,0,0,0,0,0,0,0,0,0]
[1,0.9200000000000006,1.2853028915119016,0.65,3.0874999999999999,3.1025,2.9954999999999998,3.0105,{"$f":"IF($B$7=constants!$C$60,G168,IF($B$8=constants!$C$60,C168,E168))","v":1.2853028915119016},{"$f":"IF($B$7=constants!$C$60,H168,IF($B$8=constants!$C$60,D168,F168))","v":0.65},0,0,0,0,{"$f":"IF(OR($B$22=constants!$B$60,AND(I168>$B$12,$B$12<>-1)),O167+(N168-O167)*$O$74,O167+(L168-O167)*$O$74)","v":0},0,0,0,0,0,0,0,0,0,0,0,0]
[1,0.9300000000000006,1.2873613573873202,0.65,3.0874999999999999,3.1025,2.9944999999999999,3.0095000000000001,{"$f":"IF($B$7=constants!$C$60,G169,IF($B$8=constants!$C$60,C169,E169))","v":1.2873613573873202},{"$f":"IF($B$7=constants!$C$60,H169,IF($B$8=constants!$C$60,D169,F169))","v":0.65},0,0,0,0,{"$f":"IF(OR($B$22=constants!$B$60,AND(I169>$B$12,$B$12<>-1)),O168+(N169-O168)*$O$74,O168+(L169-O168)*$O$74)","v":0},0,0,0,0,0,0,0,0,0,0,0,0]
[1,0.94000000000000061,1.2893523387243178,0.65,3.0874999999999999,3.1025,2.9934999999999996,3.0084999999999997,{"$f":"IF($B$7=constants!$C$60,G170,IF($B$8=constants!$C$60,C170,E170))","v":1.2893523387243178},{"$f":"IF($B$7=constants!$C$60,H170,IF($B$8=constants!$C$60,D170,F170))","v":0.65},0,0,0,0,{"$f":"IF(OR($B$22=constants!$B$60,AND(I170>$B$12,$B$12<>-1)),O169+(N170-O169)*$O$74,O169+(L170-O169)*$O$74)","v":0},0,0,0,0,0,0,0,0,0,0,0,0]
[1,0.95000000000000062,1.291278047929221,0.65,3.0874999999999999,3.1025,2.9924999999999997,3.0074999999999998,{"$f":"IF($B$7=constants!$C$60,G171,IF($B$8=constants!$C$60,C171,E171))","v":1.291278047929221},{"$f":"IF($B$7=constants!$C$60,H171,IF($B$8=constants!$C$60,D171,F171))","v":0.65},0,0,0,0,{"$f":"IF(OR($B$22=constants!$B$60,AND(I171>$B$12,$B$12<>-1)),O170+(N171-O170)*$O$74,O170+(L171-O170)*$O$74)","v":0},0,0,0,0,0,0,0,0,0,0,0,0]
[1,0.96000000000000063,1.2931406248770498,0.65,3.0874999999999999,3.1025,{"$f":"(H172-$H$74)/(1-EXP(-1/G$74))*(1-EXP(-$B172/G$74))","v":2.9914999999999998},3.0065,{"$f":"IF($B$7=constants!$C$60,G172,IF($B$8=constants!$C$60,C172,E172))","v":1.2931406248770498},{"$f":"IF($B$7=constants!$C$60,H172,IF($B$8=constants!$C$60,D172,F172))","v":0.65},0,0,0,0,{"$f":"IF(OR($B$22=constants!$B$60,AND(I172>$B$12,$B$12<>-1)),O171+(N172-O171)*$O$74,O171+(L172-O171)*$O$74)","v":0},0,0,0,0,0,0,0,0,0,0,0,0]
[1,0.97000000000000064,{"$f":"$B$18/(1-EXP(-1/$C$74))*(1-EXP(-B173/$C$74))","v":1.2949421392893765},0.65,3.0874999999999999,3.1025,2.9904999999999999,3.0055000000000001,{"$f":"IF($B$7=constants!$C$60,G173,IF($B$8=constants!$C$60,C173,E173))","v":1.2949421392893765},{"$f":"IF($B$7=constants!$C$60,H173,IF($B$8=constants!$C$60,D173,F173))","v":0.65},0,0,0,0,{"$f":"IF(OR($B$22=constants!$B$60,AND(I173>$B$12,$B$12<>-1)),O172+(N173-O172)*$O$74,O172+(L173-O172)*$O$74)","v":0},0,0,0,0,0,0,0,0,0,0,0,0]
[1,0.98000000000000065,1.2966845930342292,0.65,3.0874999999999999,3.1025,2.9894999999999996,3.0044999999999997,{"$f":"IF($B$7=constants!$C$60,G174,IF($B$8=constants!$C$60,C174,E174))","v":1.2966845930342292},{"$f":"IF($B$7=constants!$C$60,H174,IF($B$8=constants!$C$60,D174,F174))","v":0.65},0,0,0,0,{"$f":"IF(OR($B$22=constants!$B$60,AND(I174>$B$12,$B$12<>-1)),O173+(N174-O173)*$O$74,O173+(L174-O173)*$O$74)","v":0},0,0,0,0,0,0,0,0,0,0,0,0]
[1,0.99000000000000066,1.298369922350596,0.65,3.0874999999999999,3.1025,2.9884999999999997,3.0034999999999998,{"$f":"IF($B$7=constants!$C$60,G175,IF($B$8=constants!$C$60,C175,E175))","v":1.298369922350596},{"$f":"IF($B$7=constants!$C$60,H175,IF($B$8=constants!$C$60,D175,F175))","v":0.65},0,0,0,0,{"$f":"IF(OR($B$22=constants!$B$60,AND(I175>$B$12,$B$12<>-1)),O174+(N175-O174)*$O$74,O174+(L175-O174)*$O$74)","v":0},0,0,0,0,0,0,0,0,0,0,0,0]
[1,1.0000000000000007,{"$f":"$D$11*B176+$D$12","v":1.3000000000000052},0.65,3.0874999999999999,3.1025,{"$f":"B176*$H$41+$H$42","v":2.9885000000000002},{"$f":"H175","v":3.0034999999999998},{"$f":"IF($B$7=constants!$C$60,G176,IF($B$8=constants!$C$60,C176,E176))","v":1.3000000000000052},{"$f":"IF($B$7=constants!$C$60,H176,IF($B$8=constants!$C$60,D176,F176))","v":0.65},0,{"$f":"IF($K176=0,IF($I176>$B$16,L175+($I176-L175)*L$74-J$72,L175-L175/L$74),IF($I176>$B$17,L175+($I176-L175)*L$74-J$72,L175-L175/L$74))","v":0},{"$f":"IF($K176=0,IF($I176>$B$16,M175+($B$20-M175)*M$74-K$72,M175-M175/M$74),IF($I176>$B$17,M175+($B$20-M175)*M$74-K$72,M175-M175/M$74))","v":0},0,{"$f":"IF(OR($B$22=constants!$B$60,AND(I176>$B$12,$B$12<>-1)),O175+(N176-O175)*$O$74,O175+(L176-O175)*$O$74)","v":0},0,{"$f":"IF($K176=0,IF($I176>$B$16,R175+($B$21-R175)*R$74-R$72,R175-R175/R$74),IF($I176>$B$17,R175+($B$21-R175)*R$74-R$72,R175-R175/R$74))","v":0},0,0,0,0,0,0,0,0,0,0]
[1,1.0100000000000007,{"$f":"$D$11*$B177+$D$12","v":1.3823200000000062},0.65,{"$f":"$K$11*$B177+$K$12","v":3.1072450000000003},{"$f":"E177+$F$74","v":3.1222450000000004},{"$f":"B177*$H$41+$H$42","v":3.0032800000000002},{"$f":"H176","v":3.0034999999999998},{"$f":"IF($B$7=constants!$C$60,G177,IF($B$8=constants!$C$60,C177,E177))","v":1.3823200000000062},{"$f":"IF($B$7=constants!$C$60,H177,IF($B$8=constants!$C$60,D177,F177))","v":0.65},0,0,{"$f":"IF($K177=0,IF($I177>$B$16,M176+($B$20-M176)*M$74-K$72,M176-M176/M$74),IF($I177>$B$17,M176+($B$20-M176)*M$74-K$72,M176-M176/M$74))","v":0},0,{"$f":"IF(OR($B$22=constants!$B$60,AND(I177>$B$12,$B$12<>-1)),O176+(N177-O176)*$O$74,O176+(L177-O176)*$O$74)","v":0},0,0,0,0,0,0,0,0,0,0,0,0]
[1,1.0200000000000007,{"$f":"$D$11*B178+$D$12","v":1.4646400000000055},0.65,{"$f":"$K$11*$B178+$K$12","v":3.1119900000000005},3.1269900000000006,3.0180600000000002,3.0034999999999998,{"$f":"IF($B$7=constants!$C$60,G178,IF($B$8=constants!$C$60,C178,E178))","v":1.4646400000000055},{"$f":"IF($B$7=constants!$C$60,H178,IF($B$8=constants!$C$60,D178,F178))","v":0.65},0,0,{"$f":"IF($K178=0,IF($I178>$B$16,M177+($B$20-M177)*M$74-K$72,M177-M177/M$74),IF($I178>$B$17,M177+($B$20-M177)*M$74-K$72,M177-M177/M$74))","v":0},0,{"$f":"IF(OR($B$22=constants!$B$60,AND(I178>$B$12,$B$12<>-1)),O177+(N178-O177)*$O$74,O177+(L178-O177)*$O$74)","v":0},0,0,0,0,0,0,0,0,0,0,0,0]
[1,1.0300000000000007,1.5469600000000048,0.65,3.1167350000000003,3.1317350000000004,3.0328400000000002,3.0034999999999998,{"$f":"IF($B$7=constants!$C$60,G179,IF($B$8=constants!$C$60,C179,E179))","v":1.5469600000000048},{"$f":"IF($B$7=constants!$C$60,H179,IF($B$8=constants!$C$60,D179,F179))","v":0.65},0,0,0,0,{"$f":"IF(OR($B$22=constants!$B$60,AND(I179>$B$12,$B$12<>-1)),O178+(N179-O178)*$O$74,O178+(L179-O178)*$O$74)","v":0},0,0,0,0,0,0,0,0,0,0,0,0]
[1,1.0400000000000007,1.6292800000000058,0.65,3.1214800000000005,3.1364800000000006,3.0476200000000002,3.0034999999999998,{"$f":"IF($B$7=constants!$C$60,G180,IF($B$8=constants!$C$60,C180,E180))","v":1.6292800000000058},{"$f":"IF($B$7=constants!$C$60,H180,IF($B$8=constants!$C$60,D180,F180))","v":0.65},0,0,0,0,{"$f":"IF(OR($B$22=constants!$B$60,AND(I180>$B$12,$B$12<>-1)),O179+(N180-O179)*$O$74,O179+(L180-O179)*$O$74)","v":0},0,0,0,0,0,0,0,0,0,0,0,0]
[1,1.0500000000000007,1.7116000000000051,0.65,3.1262250000000003,3.1412250000000004,3.0624000000000002,3.0034999999999998,{"$f":"IF($B$7=constants!$C$60,G181,IF($B$8=constants!$C$60,C181,E181))","v":1.7116000000000051},{"$f":"IF($B$7=constants!$C$60,H181,IF($B$8=constants!$C$60,D181,F181))","v":0.65},0,0,0,0,{"$f":"IF(OR($B$22=constants!$B$60,AND(I181>$B$12,$B$12<>-1)),O180+(N181-O180)*$O$74,O180+(L181-O180)*$O$74)","v":0},0,0,0,0,0,0,0,0,0,0,0,0]
[1,1.0600000000000007,1.7939200000000062,0.65,3.1309700000000005,3.1459700000000006,3.0771800000000002,3.0034999999999998,{"$f":"IF($B$7=constants!$C$60,G182,IF($B$8=constants!$C$60,C182,E182))","v":1.7939200000000062},{"$f":"IF($B$7=constants!$C$60,H182,IF($B$8=constants!$C$60,D182,F182))","v":0.65},0,0,0,0,{"$f":"IF(OR($B$22=constants!$B$60,AND(I182>$B$12,$B$12<>-1)),O181+(N182-O181)*$O$74,O181+(L182-O181)*$O$74)","v":0},0,0,0,0,0,0,0,0,0,0,0,0]
[1,1.0700000000000007,1.8762400000000055,0.65,3.1357150000000003,3.1507150000000004,3.0919600000000003,3.0034999999999998,{"$f":"IF($B$7=constants!$C$60,G183,IF($B$8=constants!$C$60,C183,E183))","v":1.8762400000000055},{"$f":"IF($B$7=constants!$C$60,H183,IF($B$8=constants!$C$60,D183,F183))","v":0.65},0,0,0,0,{"$f":"IF(OR($B$22=constants!$B$60,AND(I183>$B$12,$B$12<>-1)),O182+(N183-O182)*$O$74,O182+(L183-O182)*$O$74)","v":0},0,0,0,0,0,0,0,0,0,0,0,0]
[1,1.0800000000000007,1.9585600000000065,0.65,3.1404600000000005,3.1554600000000006,3.1067400000000003,3.0034999999999998,{"$f":"IF($B$7=constants!$C$60,G184,IF($B$8=constants!$C$60,C184,E184))","v":1.9585600000000065},{"$f":"IF($B$7=constants!$C$60,H184,IF($B$8=constants!$C$60,D184,F184))","v":0.65},0,0,0,0,{"$f":"IF(OR($B$22=constants!$B$60,AND(I184>$B$12,$B$12<>-1)),O183+(N184-O183)*$O$74,O183+(L184-O183)*$O$74)","v":0},0,0,0,0,0,0,0,0,0,0,0,0]
[1,1.0900000000000007,2.0408800000000058,0.65,3.1452050000000003,3.1602050000000004,3.1215200000000003,3.0034999999999998,{"$f":"IF($B$7=constants!$C$60,G185,IF($B$8=constants!$C$60,C185,E185))","v":2.0408800000000058},{"$f":"IF($B$7=constants!$C$60,H185,IF($B$8=constants!$C$60,D185,F185))","v":0.65},0,0,0,0,{"$f":"IF(OR($B$22=constants!$B$60,AND(I185>$B$12,$B$12<>-1)),O184+(N185-O184)*$O$74,O184+(L185-O184)*$O$74)","v":0},0,0,0,0,0,0,0,0,0,0,0,0]
[1,1.1000000000000008,2.1232000000000051,0.65,3.1499500000000005,3.1649500000000006,3.1363000000000003,3.0034999999999998,{"$f":"IF($B$7=constants!$C$60,G186,IF($B$8=constants!$C$60,C186,E186))","v":2.1232000000000051},{"$f":"IF($B$7=constants!$C$60,H186,IF($B$8=constants!$C$60,D186,F186))","v":0.65},0,0,0,0,{"$f":"IF(OR($B$22=constants!$B$60,AND(I186>$B$12,$B$12<>-1)),O185+(N186-O185)*$O$74,O185+(L186-O185)*$O$74)","v":0},0,0,0,0,0,0,0,0,0,0,0,0]
[1,1.1100000000000008,2.2055200000000061,0.65,3.1546950000000002,3.1696950000000004,3.1510800000000003,3.0034999999999998,{"$f":"IF($B$7=constants!$C$60,G187,IF($B$8=constants!$C$60,C187,E187))","v":2.2055200000000061},{"$f":"IF($B$7=constants!$C$60,H187,IF($B$8=constants!$C$60,D187,F187))","v":0.65},0,0,0,0,{"$f":"IF(OR($B$22=constants!$B$60,AND(I187>$B$12,$B$12<>-1)),O186+(N187-O186)*$O$74,O186+(L187-O186)*$O$74)","v":0},0,0,0,0,0,0,0,0,0,0,0,0]
[1,1.1200000000000008,2.2878400000000054,0.65,3.1594400000000005,3.1744400000000006,3.1658600000000003,3.0034999999999998,{"$f":"IF($B$7=constants!$C$60,G188,IF($B$8=constants!$C$60,C188,E188))","v":2.2878400000000054},{"$f":"IF($B$7=constants!$C$60,H188,IF($B$8=constants!$C$60,D188,F188))","v":0.65},0,0,0,0,{"$f":"IF(OR($B$22=constants!$B$60,AND(I188>$B$12,$B$12<>-1)),O187+(N188-O187)*$O$74,O187+(L188-O187)*$O$74)","v":0},0,0,0,0,0,0,0,0,0,0,0,0]
[1,1.1300000000000008,2.3701600000000065,0.65,3.1641850000000002,3.1791850000000004,3.1806400000000004,3.0034999999999998,{"$f":"IF($B$7=constants!$C$60,G189,IF($B$8=constants!$C$60,C189,E189))","v":2.3701600000000065},{"$f":"IF($B$7=constants!$C$60,H189,IF($B$8=constants!$C$60,D189,F189))","v":0.65},0,0,0,0,{"$f":"IF(OR($B$22=constants!$B$60,AND(I189>$B$12,$B$12<>-1)),O188+(N189-O188)*$O$74,O188+(L189-O188)*$O$74)","v":0},0,0,0,0,0,0,0,0,0,0,0,0]
[1,1.1400000000000008,2.4524800000000058,0.65,3.1689300000000005,3.1839300000000006,3.1954200000000004,3.0034999999999998,{"$f":"IF($B$7=constants!$C$60,G190,IF($B$8=constants!$C$60,C190,E190))","v":2.4524800000000058},{"$f":"IF($B$7=constants!$C$60,H190,IF($B$8=constants!$C$60,D190,F190))","v":0.65},0,0,0,0,{"$f":"IF(OR($B$22=constants!$B$60,AND(I190>$B$12,$B$12<>-1)),O189+(N190-O189)*$O$74,O189+(L190-O189)*$O$74)","v":0},0,0,0,0,0,0,0,0,0,0,0,0]
[1,1.1500000000000008,2.5348000000000068,0.65,3.1736750000000002,3.1886750000000004,3.2102000000000004,3.0034999999999998,{"$f":"IF($B$7=constants!$C$60,G191,IF($B$8=constants!$C$60,C191,E191))","v":2.5348000000000068},{"$f":"IF($B$7=constants!$C$60,H191,IF($B$8=constants!$C$60,D191,F191))","v":0.65},0,0,0,0,{"$f":"IF(OR($B$22=constants!$B$60,AND(I191>$B$12,$B$12<>-1)),O190+(N191-O190)*$O$74,O190+(L191-O190)*$O$74)","v":0},0,0,0,0,0,0,0,0,0,0,0,0]
[1,1.1600000000000008,2.6171200000000061,0.65,3.1784200000000005,3.1934200000000006,3.2249800000000004,3.0034999999999998,{"$f":"IF($B$7=constants!$C$60,G192,IF($B$8=constants!$C$60,C192,E192))","v":2.6171200000000061},{"$f":"IF($B$7=constants!$C$60,H192,IF($B$8=constants!$C$60,D192,F192))","v":0.65},0,0,0,0,{"$f":"IF(OR($B$22=constants!$B$60,AND(I192>$B$12,$B$12<>-1)),O191+(N192-O191)*$O$74,O191+(L192-O191)*$O$74)","v":0},0,0,0,0,0,0,0,0,0,0,0,0]
[1,1.1700000000000008,2.6994400000000072,0.65,3.1831650000000002,3.1981650000000004,3.2397600000000004,3.0034999999999998,{"$f":"IF($B$7=constants!$C$60,G193,IF($B$8=constants!$C$60,C193,E193))","v":2.6994400000000072},{"$f":"IF($B$7=constants!$C$60,H193,IF($B$8=constants!$C$60,D193,F193))","v":0.65},0,0,0,{"$f":"IF(M193>I193,L193,M193)","v":0},{"$f":"IF(OR($B$22=constants!$B$60,AND(I193>$B$12,$B$12<>-1)),O192+(N193-O192)*$O$74,O192+(L193-O192)*$O$74)","v":0},0,0,0,0,0,0,0,0,0,0,0,0]
[1,1.1800000000000008,2.7817600000000064,0.65,3.1879100000000005,3.2029100000000006,3.2545400000000004,3.0034999999999998,{"$f":"IF($B$7=constants!$C$60,G194,IF($B$8=constants!$C$60,C194,E194))","v":2.7817600000000064},{"$f":"IF($B$7=constants!$C$60,H194,IF($B$8=constants!$C$60,D194,F194))","v":0.65},0,0,0,{"$f":"IF(M194>I194,L194,M194)","v":0},{"$f":"IF(OR($B$22=constants!$B$60,AND(I194>$B$12,$B$12<>-1)),O193+(N194-O193)*$O$74,O193+(L194-O193)*$O$74)","v":0},0,0,0,0,0,0,0,0,0,0,0,0]
[1,1.1900000000000008,2.8640800000000057,0.65,3.1926550000000002,3.2076550000000004,3.2693200000000004,3.0034999999999998,{"$f":"IF($B$7=constants!$C$60,G195,IF($B$8=constants!$C$60,C195,E195))","v":2.8640800000000057},{"$f":"IF($B$7=constants!$C$60,H195,IF($B$8=constants!$C$60,D195,F195))","v":0.65},1,2.8640800000000057,2.6,2.6,{"$f":"IF(OR($B$22=constants!$B$60,AND(I195>$B$12,$B$12<>-1)),O194+(N195-O194)*$O$74,O194+(L195-O194)*$O$74)","v":2.3400000000000003},2.3200000000000003,2.6,2.6,2.6,2.6,2.6,2.3400000000000003,2.3400000000000003,2.3400000000000003,2.3100000000000005,2.3050000000000002,2.3000000000000003]
[1,1.2000000000000008,2.9464000000000068,0.65,3.1974000000000005,3.2124000000000006,3.2841000000000005,3.0034999999999998,{"$f":"IF($B$7=constants!$C$60,G196,IF($B$8=constants!$C$60,C196,E196))","v":2.9464000000000068},{"$f":"IF($B$7=constants!$C$60,H196,IF($B$8=constants!$C$60,D196,F196))","v":0.65},1,2.9464000000000068,2.6,2.6,{"$f":"IF(OR($B$22=constants!$B$60,AND(I196>$B$12,$B$12<>-1)),O195+(N196-O195)*$O$74,O195+(L196-O195)*$O$74)","v":2.5740000000000003},2.5540000000000003,2.6,2.6,2.6,2.6,2.6,2.5740000000000003,2.5740000000000003,2.5740000000000003,2.5440000000000005,2.5390000000000001,2.5340000000000003]
[1,1.2100000000000009,3.0287200000000061,0.65,3.2021450000000007,3.2171450000000008,3.2988800000000005,3.0034999999999998,{"$f":"IF($B$7=constants!$C$60,G197,IF($B$8=constants!$C$60,C197,E197))","v":3.0287200000000061},{"$f":"IF($B$7=constants!$C$60,H197,IF($B$8=constants!$C$60,D197,F197))","v":0.65},1,3.0287200000000061,2.6,2.6,{"$f":"IF(OR($B$22=constants!$B$60,AND(I197>$B$12,$B$12<>-1)),O196+(N197-O196)*$O$74,O196+(L197-O196)*$O$74)","v":2.5973999999999999},2.5773999999999999,2.6,2.6,2.6,2.6,2.6,2.5973999999999999,2.5973999999999999,2.5973999999999999,2.5674000000000001,2.5623999999999998,2.5573999999999999]
[1,1.2200000000000009,3.1110400000000071,0.65,3.2068900000000005,3.2218900000000006,3.3136600000000005,3.0034999999999998,{"$f":"IF($B$7=constants!$C$60,G198,IF($B$8=constants!$C$60,C198,E198))","v":3.1110400000000071},{"$f":"IF($B$7=constants!$C$60,H198,IF($B$8=constants!$C$60,D198,F198))","v":0.65},1,3.1110400000000071,2.6,2.6,{"$f":"IF(OR($B$22=constants!$B$60,AND(I198>$B$12,$B$12<>-1)),O197+(N198-O197)*$O$74,O197+(L198-O197)*$O$74)","v":2.5997400000000002},2.5797400000000001,2.6,2.6,2.6,2.6,2.6,2.5997400000000002,2.5997400000000002,2.5997400000000002,2.5697400000000004,2.56474,2.5597400000000001]
[1,1.2300000000000009,3.1933600000000064,0.65,3.2116350000000002,3.2266350000000004,3.3284400000000005,3.0034999999999998,{"$f":"IF($B$7=constants!$C$60,G199,IF($B$8=constants!$C$60,C199,E199))","v":3.1933600000000064},{"$f":"IF($B$7=constants!$C$60,H199,IF($B$8=constants!$C$60,D199,F199))","v":0.65},1,3.1933600000000064,2.6,2.6,{"$f":"IF(OR($B$22=constants!$B$60,AND(I199>$B$12,$B$12<>-1)),O198+(N199-O198)*$O$74,O198+(L199-O198)*$O$74)","v":2.599974},2.579974,2.6,2.6,2.6,2.6,2.6,2.599974,2.599974,2.599974,2.5699740000000002,2.5649739999999999,2.559974]
[1,1.2400000000000009,3.2756800000000075,0.65,3.2163800000000005,3.2313800000000006,3.3432200000000005,3.0034999999999998,{"$f":"IF($B$7=constants!$C$60,G200,IF($B$8=constants!$C$60,C200,E200))","v":3.2756800000000075},{"$f":"IF($B$7=constants!$C$60,H200,IF($B$8=constants!$C$60,D200,F200))","v":0.65},1,3.2756800000000075,2.6,2.6,{"$f":"IF(OR($B$22=constants!$B$60,AND(I200>$B$12,$B$12<>-1)),O199+(N200-O199)*$O$74,O199+(L200-O199)*$O$74)","v":2.5999973999999999},2.5799973999999999,2.6,2.6,2.6,2.6,2.6,2.5999973999999999,2.5999973999999999,2.5999973999999999,2.5699974000000001,2.5649973999999998,2.5599973999999999]
[1,1.2500000000000009,{"$f":"$D$15*B201+$D$16","v":3.3579999999999983},0.65,3.2211250000000007,3.2361250000000008,{"$f":"B201*$H$46+$H$47","v":3.3579999999999983},3.0034999999999998,{"$f":"IF($B$7=constants!$C$60,G201,IF($B$8=constants!$C$60,C201,E201))","v":3.3579999999999983},{"$f":"IF($B$7=constants!$C$60,H201,IF($B$8=constants!$C$60,D201,F201))","v":0.65},1,3.3579999999999983,2.6,2.6,{"$f":"IF(OR($B$22=constants!$B$60,AND(I201>$B$12,$B$12<>-1)),O200+(N201-O200)*$O$74,O200+(L201-O200)*$O$74)","v":2.5999997399999999},2.5799997399999999,2.6,2.6,2.6,2.6,2.6,2.5999997399999999,2.5999997399999999,2.5999997399999999,2.5699997400000001,2.5649997399999998,2.5599997399999999]
[1,1.2600000000000009,{"$f":"$D$15*$B202+$D$16","v":3.3375599999999981},{"$f":"$G$15*$B202+$G$16","v":0.693940000000004},3.2258700000000005,3.2408700000000006,{"$f":"B202*$H$46+$H$47","v":3.3375599999999981},3.0034999999999998,{"$f":"IF($B$7=constants!$C$60,G202,IF($B$8=constants!$C$60,C202,E202))","v":3.3375599999999981},{"$f":"IF($B$7=constants!$C$60,H202,IF($B$8=constants!$C$60,D202,F202))","v":0.693940000000004},1,3.3375599999999981,2.6,2.6,{"$f":"IF(OR($B$22=constants!$B$60,AND(I202>$B$12,$B$12<>-1)),O201+(N202-O201)*$O$74,O201+(L202-O201)*$O$74)","v":2.5999999740000002},2.5799999740000001,2.6,2.6,2.6,2.6,2.6,2.5999999740000002,2.5999999740000002,2.5999999740000002,2.5699999740000004,2.564999974,2.5599999740000001]
[1,1.2700000000000009,{"$f":"$D$15*B203+$D$16","v":3.3171199999999983},{"$f":"$G$15*$B203+$G$16","v":0.73788000000000409},3.2306150000000002,3.2456150000000004,3.3171199999999983,3.0034999999999998,{"$f":"IF($B$7=constants!$C$60,G203,IF($B$8=constants!$C$60,C203,E203))","v":3.3171199999999983},{"$f":"IF($B$7=constants!$C$60,H203,IF($B$8=constants!$C$60,D203,F203))","v":0.73788000000000409},1,3.3171199999999983,2.6,2.6,{"$f":"IF(OR($B$22=constants!$B$60,AND(I203>$B$12,$B$12<>-1)),O202+(N203-O202)*$O$74,O202+(L203-O202)*$O$74)","v":2.5999999974000003},2.5799999974000003,2.6,2.6,2.6,2.6,2.6,2.5999999974000003,2.5999999974000003,2.5999999974000003,2.5699999974000005,2.5649999974000002,2.5599999974000003]
[1,1.2800000000000009,3.2966799999999981,0.78182000000000418,3.2353600000000005,3.2503600000000006,3.2966799999999981,3.0034999999999998,{"$f":"IF($B$7=constants!$C$60,G204,IF($B$8=constants!$C$60,C204,E204))","v":3.2966799999999981},{"$f":"IF($B$7=constants!$C$60,H204,IF($B$8=constants!$C$60,D204,F204))","v":0.78182000000000418},1,3.2966799999999981,2.6,2.6,{"$f":"IF(OR($B$22=constants!$B$60,AND(I204>$B$12,$B$12<>-1)),O203+(N204-O203)*$O$74,O203+(L204-O203)*$O$74)","v":2.5999999997400001},2.57999999974,2.6,2.6,2.6,2.6,2.6,2.5999999997400001,2.5999999997400001,2.5999999997400001,2.5699999997400003,2.5649999997399999,2.55999999974]
[{"$f":"IF(B205<=100,1,IF(B205<=200,2,3))","v":1},1.2900000000000009,3.2762399999999983,0.82576000000000427,3.2401050000000007,3.2551050000000008,3.2762399999999983,3.0034999999999998,{"$f":"IF($B$7=constants!$C$60,G205,IF($B$8=constants!$C$60,C205,E205))","v":3.2762399999999983},{"$f":"IF($B$7=constants!$C$60,H205,IF($B$8=constants!$C$60,D205,F205))","v":0.82576000000000427},1,3.2762399999999983,2.6,2.6,{"$f":"IF(OR($B$22=constants!$B$60,AND(I205>$B$12,$B$12<>-1)),O204+(N205-O204)*$O$74,O204+(L205-O204)*$O$74)","v":2.599999999974},{"$f":"IF(O205=0,0,O205-$P$72)","v":2.579999999974},2.6,2.6,{"$f":"S$72*IF(S$71=0,$L205,IF(S$71=1,$R205,IF($B$12=-1,$L205,IF($I205>$B$12,$R205,$L205))))","v":2.6},2.6,2.6,2.599999999974,2.599999999974,2.599999999974,{"$f":"IF(V205=0,0,V205-Y$72)","v":2.5699999999740002},{"$f":"IF(W205=0,0,W205-Z$72)","v":2.5649999999739999},{"$f":"IF(X205=0,0,X205-AA$72)","v":2.559999999974}]
[1,{"$f":"B205+0.01","v":1.3000000000000009},3.2557999999999985,0.86970000000000436,3.2448500000000005,3.2598500000000006,3.2557999999999985,3.0034999999999998,{"$f":"IF($B$7=constants!$C$60,G206,IF($B$8=constants!$C$60,C206,E206))","v":3.2557999999999985},{"$f":"IF($B$7=constants!$C$60,H206,IF($B$8=constants!$C$60,D206,F206))","v":0.86970000000000436},{"$f":"IF(AND(I206>$B$16,K205=0),1,IF(AND(I206<$B$17,K205=1),0,K205))","v":1},3.2557999999999985,2.6,2.6,{"$f":"IF(OR($B$22=constants!$B$60,AND(I206>$B$12,$B$12<>-1)),O205+(N206-O205)*$O$74,O205+(L206-O205)*$O$74)","v":2.5999999999973999},2.5799999999973999,2.6,{"$f":"IF(Q206>I206,I206,Q206)","v":2.6},2.6,2.6,2.6,{"$f":"V205+(S206-V$72-V205)*V$74","v":2.5999999999973999},{"$f":"W205+(T206-W$72-W205)*W$74","v":2.5999999999973999},{"$f":"X205+(U206-X$72-X205)*X$74","v":2.5999999999973999},2.5699999999974001,2.5649999999973998,2.5599999999973999]
[1,1.3100000000000009,3.2353599999999982,0.91364000000000445,3.2495950000000002,3.2645950000000004,3.2353599999999982,3.0034999999999998,{"$f":"IF($B$7=constants!$C$60,G207,IF($B$8=constants!$C$60,C207,E207))","v":3.2353599999999982},{"$f":"IF($B$7=constants!$C$60,H207,IF($B$8=constants!$C$60,D207,F207))","v":0.91364000000000445},1,3.2353599999999982,2.6,2.6,{"$f":"IF(OR($B$22=constants!$B$60,AND(I207>$B$12,$B$12<>-1)),O206+(N207-O206)*$O$74,O206+(L207-O206)*$O$74)","v":2.5999999999997403},2.5799999999997403,2.6,2.6,2.6,2.6,2.6,2.5999999999997403,2.5999999999997403,2.5999999999997403,2.5699999999997405,2.5649999999997402,2.5599999999997403]
[1,1.320000000000001,3.2149199999999984,0.95758000000000454,3.2543400000000005,3.2693400000000006,3.2149199999999984,3.0034999999999998,{"$f":"IF($B$7=constants!$C$60,G208,IF($B$8=constants!$C$60,C208,E208))","v":3.2149199999999984},{"$f":"IF($B$7=constants!$C$60,H208,IF($B$8=constants!$C$60,D208,F208))","v":0.95758000000000454},1,3.2149199999999984,2.6,2.6,{"$f":"IF(OR($B$22=constants!$B$60,AND(I208>$B$12,$B$12<>-1)),O207+(N208-O207)*$O$74,O207+(L208-O207)*$O$74)","v":2.5999999999999739},2.5799999999999739,2.6,2.6,2.6,2.6,2.6,2.5999999999999739,2.5999999999999739,2.5999999999999739,2.5699999999999741,2.5649999999999737,2.5599999999999739]
[1,1.330000000000001,3.1944799999999982,1.0015200000000037,3.2590850000000007,{"$f":"E209+$F$74","v":3.2740850000000008},3.1944799999999982,3.0034999999999998,{"$f":"IF($B$7=constants!$C$60,G209,IF($B$8=constants!$C$60,C209,E209))","v":3.1944799999999982},{"$f":"IF($B$7=constants!$C$60,H209,IF($B$8=constants!$C$60,D209,F209))","v":1.0015200000000037},1,3.1944799999999982,2.6,2.6,{"$f":"IF(OR($B$22=constants!$B$60,AND(I209>$B$12,$B$12<>-1)),O208+(N209-O208)*$O$74,O208+(L209-O208)*$O$74)","v":2.5999999999999974},2.5799999999999974,2.6,2.6,2.6,2.6,2.6,2.5999999999999974,2.5999999999999974,2.5999999999999974,2.5699999999999976,2.5649999999999973,2.5599999999999974]
[1,1.340000000000001,3.1740399999999984,1.0454600000000038,3.2638300000000005,3.2788300000000006,3.1740399999999984,3.0034999999999998,{"$f":"IF($B$7=constants!$C$60,G210,IF($B$8=constants!$C$60,C210,E210))","v":3.1740399999999984},{"$f":"IF($B$7=constants!$C$60,H210,IF($B$8=constants!$C$60,D210,F210))","v":1.0454600000000038},1,3.1740399999999984,2.6,2.6,{"$f":"IF(OR($B$22=constants!$B$60,AND(I210>$B$12,$B$12<>-1)),O209+(N210-O209)*$O$74,O209+(L210-O209)*$O$74)","v":2.5999999999999996},2.5799999999999996,2.6,2.6,2.6,2.6,2.6,2.5999999999999996,2.5999999999999996,2.5999999999999996,2.57,2.5649999999999995,2.5599999999999996]
[1,1.350000000000001,3.1535999999999982,1.0894000000000039,3.2685750000000002,3.2835750000000004,3.1535999999999982,3.0034999999999998,{"$f":"IF($B$7=constants!$C$60,G211,IF($B$8=constants!$C$60,C211,E211))","v":3.1535999999999982},{"$f":"IF($B$7=constants!$C$60,H211,IF($B$8=constants!$C$60,D211,F211))","v":1.0894000000000039},1,3.1535999999999982,2.6,2.6,{"$f":"IF(OR($B$22=constants!$B$60,AND(I211>$B$12,$B$12<>-1)),O210+(N211-O210)*$O$74,O210+(L211-O210)*$O$74)","v":2.6},2.58,2.6,2.6,2.6,2.6,2.6,2.6,2.6,2.6,2.5700000000000003,2.5649999999999999,2.56]
[1,1.360000000000001,3.1331599999999984,1.133340000000004,3.2733200000000005,3.2883200000000006,3.1331599999999984,3.0034999999999998,{"$f":"IF($B$7=constants!$C$60,G212,IF($B$8=constants!$C$60,C212,E212))","v":3.1331599999999984},{"$f":"IF($B$7=constants!$C$60,H212,IF($B$8=constants!$C$60,D212,F212))","v":1.133340000000004},1,3.1331599999999984,2.6,2.6,{"$f":"IF(OR($B$22=constants!$B$60,AND(I212>$B$12,$B$12<>-1)),O211+(N212-O211)*$O$74,O211+(L212-O211)*$O$74)","v":2.6},2.58,2.6,2.6,2.6,2.6,2.6,2.6,2.6,2.6,2.5700000000000003,2.5649999999999999,2.56]
[1,1.370000000000001,3.1127199999999982,1.1772800000000041,3.2780650000000007,3.2930650000000008,3.1127199999999982,3.0034999999999998,{"$f":"IF($B$7=constants!$C$60,G213,IF($B$8=constants!$C$60,C213,E213))","v":3.1127199999999982},{"$f":"IF($B$7=constants!$C$60,H213,IF($B$8=constants!$C$60,D213,F213))","v":1.1772800000000041},1,3.1127199999999982,2.6,2.6,{"$f":"IF(OR($B$22=constants!$B$60,AND(I213>$B$12,$B$12<>-1)),O212+(N213-O212)*$O$74,O212+(L213-O212)*$O$74)","v":2.6},2.58,2.6,2.6,2.6,2.6,2.6,2.6,2.6,2.6,2.5700000000000003,2.5649999999999999,2.56]
[1,1.380000000000001,3.0922799999999984,1.2212200000000042,3.2828100000000004,3.2978100000000006,3.0922799999999984,3.0034999999999998,{"$f":"IF($B$7=constants!$C$60,G214,IF($B$8=constants!$C$60,C214,E214))","v":3.0922799999999984},{"$f":"IF($B$7=constants!$C$60,H214,IF($B$8=constants!$C$60,D214,F214))","v":1.2212200000000042},1,3.0922799999999984,2.6,2.6,{"$f":"IF(OR($B$22=constants!$B$60,AND(I214>$B$12,$B$12<>-1)),O213+(N214-O213)*$O$74,O213+(L214-O213)*$O$74)","v":2.6},2.58,2.6,2.6,2.6,2.6,2.6,2.6,2.6,2.6,2.5700000000000003,2.5649999999999999,2.56]
[1,1.390000000000001,3.0718399999999981,1.2651600000000043,3.2875550000000002,3.3025550000000004,3.0718399999999981,3.0034999999999998,{"$f":"IF($B$7=constants!$C$60,G215,IF($B$8=constants!$C$60,C215,E215))","v":3.0718399999999981},{"$f":"IF($B$7=constants!$C$60,H215,IF($B$8=constants!$C$60,D215,F215))","v":1.2651600000000043},1,3.0718399999999981,2.6,2.6,{"$f":"IF(OR($B$22=constants!$B$60,AND(I215>$B$12,$B$12<>-1)),O214+(N215-O214)*$O$74,O214+(L215-O214)*$O$74)","v":2.6},2.58,2.6,2.6,2.6,2.6,2.6,2.6,2.6,2.6,2.5700000000000003,2.5649999999999999,2.56]
[1,1.400000000000001,3.0513999999999983,1.3091000000000044,3.2923000000000004,3.3073000000000006,3.0513999999999983,3.0034999999999998,{"$f":"IF($B$7=constants!$C$60,G216,IF($B$8=constants!$C$60,C216,E216))","v":3.0513999999999983},{"$f":"IF($B$7=constants!$C$60,H216,IF($B$8=constants!$C$60,D216,F216))","v":1.3091000000000044},1,3.0513999999999983,2.6,2.6,{"$f":"IF(OR($B$22=constants!$B$60,AND(I216>$B$12,$B$12<>-1)),O215+(N216-O215)*$O$74,O215+(L216-O215)*$O$74)","v":2.6},2.58,2.6,2.6,2.6,2.6,2.6,2.6,2.6,2.6,2.5700000000000003,2.5649999999999999,2.56]
[1,1.410000000000001,3.0309599999999981,1.3530400000000045,3.2970450000000007,3.3120450000000008,3.0309599999999981,3.0034999999999998,{"$f":"IF($B$7=constants!$C$60,G217,IF($B$8=constants!$C$60,C217,E217))","v":3.0309599999999981},{"$f":"IF($B$7=constants!$C$60,H217,IF($B$8=constants!$C$60,D217,F217))","v":1.3530400000000045},1,3.0309599999999981,2.6,2.6,{"$f":"IF(OR($B$22=constants!$B$60,AND(I217>$B$12,$B$12<>-1)),O216+(N217-O216)*$O$74,O216+(L217-O216)*$O$74)","v":2.6},2.58,2.6,2.6,2.6,2.6,2.6,2.6,2.6,2.6,2.5700000000000003,2.5649999999999999,2.56]
[1,1.420000000000001,3.0105199999999983,1.3969800000000046,3.3017900000000004,3.3167900000000006,3.0105199999999983,3.0034999999999998,{"$f":"IF($B$7=constants!$C$60,G218,IF($B$8=constants!$C$60,C218,E218))","v":3.0105199999999983},{"$f":"IF($B$7=constants!$C$60,H218,IF($B$8=constants!$C$60,D218,F218))","v":1.3969800000000046},1,3.0105199999999983,2.6,2.6,{"$f":"IF(OR($B$22=constants!$B$60,AND(I218>$B$12,$B$12<>-1)),O217+(N218-O217)*$O$74,O217+(L218-O217)*$O$74)","v":2.6},2.58,2.6,2.6,2.6,2.6,2.6,2.6,2.6,2.6,2.5700000000000003,2.5649999999999999,2.56]
[1,1.430000000000001,2.9900799999999981,1.4409200000000046,3.3065350000000002,3.3215350000000003,2.9900799999999981,3.0034999999999998,{"$f":"IF($B$7=constants!$C$60,G219,IF($B$8=constants!$C$60,C219,E219))","v":2.9900799999999981},{"$f":"IF($B$7=constants!$C$60,H219,IF($B$8=constants!$C$60,D219,F219))","v":1.4409200000000046},1,2.9900799999999981,2.6,2.6,{"$f":"IF(OR($B$22=constants!$B$60,AND(I219>$B$12,$B$12<>-1)),O218+(N219-O218)*$O$74,O218+(L219-O218)*$O$74)","v":2.6},2.58,2.6,2.6,2.6,2.6,2.6,2.6,2.6,2.6,2.5700000000000003,2.5649999999999999,2.56]
[1,1.4400000000000011,2.9696399999999983,1.4848600000000047,3.3112800000000004,3.3262800000000006,2.9696399999999983,3.0034999999999998,{"$f":"IF($B$7=constants!$C$60,G220,IF($B$8=constants!$C$60,C220,E220))","v":2.9696399999999983},{"$f":"IF($B$7=constants!$C$60,H220,IF($B$8=constants!$C$60,D220,F220))","v":1.4848600000000047},1,2.9696399999999983,2.6,2.6,{"$f":"IF(OR($B$22=constants!$B$60,AND(I220>$B$12,$B$12<>-1)),O219+(N220-O219)*$O$74,O219+(L220-O219)*$O$74)","v":2.6},2.58,2.6,2.6,2.6,2.6,2.6,2.6,2.6,2.6,2.5700000000000003,2.5649999999999999,2.56]
[1,1.4500000000000011,2.949199999999998,1.5288000000000048,3.3160250000000007,3.3310250000000008,2.949199999999998,3.0034999999999998,{"$f":"IF($B$7=constants!$C$60,G221,IF($B$8=constants!$C$60,C221,E221))","v":2.949199999999998},{"$f":"IF($B$7=constants!$C$60,H221,IF($B$8=constants!$C$60,D221,F221))","v":1.5288000000000048},1,2.949199999999998,2.6,2.6,{"$f":"IF(OR($B$22=constants!$B$60,AND(I221>$B$12,$B$12<>-1)),O220+(N221-O220)*$O$74,O220+(L221-O220)*$O$74)","v":2.6},2.58,2.6,2.6,2.6,2.6,2.6,2.6,2.6,2.6,2.5700000000000003,2.5649999999999999,2.56]
[1,1.4600000000000011,2.9287599999999983,1.5727400000000049,3.3207700000000004,3.3357700000000006,2.9287599999999983,3.0034999999999998,{"$f":"IF($B$7=constants!$C$60,G222,IF($B$8=constants!$C$60,C222,E222))","v":2.9287599999999983},{"$f":"IF($B$7=constants!$C$60,H222,IF($B$8=constants!$C$60,D222,F222))","v":1.5727400000000049},1,2.9287599999999983,2.6,2.6,{"$f":"IF(OR($B$22=constants!$B$60,AND(I222>$B$12,$B$12<>-1)),O221+(N222-O221)*$O$74,O221+(L222-O221)*$O$74)","v":2.6},2.58,2.6,2.6,2.6,2.6,2.6,2.6,2.6,2.6,2.5700000000000003,2.5649999999999999,2.56]
[1,1.4700000000000011,2.908319999999998,1.616680000000005,3.3255150000000007,3.3405150000000008,2.908319999999998,3.0034999999999998,{"$f":"IF($B$7=constants!$C$60,G223,IF($B$8=constants!$C$60,C223,E223))","v":2.908319999999998},{"$f":"IF($B$7=constants!$C$60,H223,IF($B$8=constants!$C$60,D223,F223))","v":1.616680000000005},1,2.908319999999998,2.6,2.6,{"$f":"IF(OR($B$22=constants!$B$60,AND(I223>$B$12,$B$12<>-1)),O222+(N223-O222)*$O$74,O222+(L223-O222)*$O$74)","v":2.6},2.58,2.6,2.6,2.6,2.6,2.6,2.6,2.6,2.6,2.5700000000000003,2.5649999999999999,2.56]
[1,1.4800000000000011,2.8878799999999982,1.6606200000000051,3.3302600000000004,3.3452600000000006,2.8878799999999982,3.0034999999999998,{"$f":"IF($B$7=constants!$C$60,G224,IF($B$8=constants!$C$60,C224,E224))","v":2.8878799999999982},{"$f":"IF($B$7=constants!$C$60,H224,IF($B$8=constants!$C$60,D224,F224))","v":1.6606200000000051},1,2.8878799999999982,2.6,2.6,{"$f":"IF(OR($B$22=constants!$B$60,AND(I224>$B$12,$B$12<>-1)),O223+(N224-O223)*$O$74,O223+(L224-O223)*$O$74)","v":2.6},2.58,2.6,2.6,2.6,2.6,2.6,2.6,2.6,2.6,2.5700000000000003,2.5649999999999999,2.56]
[1,1.4900000000000011,2.867439999999998,1.7045600000000052,3.3350050000000007,3.3500050000000008,2.867439999999998,3.0034999999999998,{"$f":"IF($B$7=constants!$C$60,G225,IF($B$8=constants!$C$60,C225,E225))","v":2.867439999999998},{"$f":"IF($B$7=constants!$C$60,H225,IF($B$8=constants!$C$60,D225,F225))","v":1.7045600000000052},1,2.867439999999998,2.6,2.6,{"$f":"IF(OR($B$22=constants!$B$60,AND(I225>$B$12,$B$12<>-1)),O224+(N225-O224)*$O$74,O224+(L225-O224)*$O$74)","v":2.6},2.58,2.6,2.6,2.6,2.6,2.6,2.6,2.6,2.6,2.5700000000000003,2.5649999999999999,2.56]
[1,1.5000000000000011,{"$f":"$D$19*B226+$D$20","v":2.8470000000000026},1.7485000000000044,3.3397500000000004,3.3547500000000006,{"$f":"B226*$H$51+$H$52","v":2.8470000000000026},3.0034999999999998,{"$f":"IF($B$7=constants!$C$60,G226,IF($B$8=constants!$C$60,C226,E226))","v":2.8470000000000026},{"$f":"IF($B$7=constants!$C$60,H226,IF($B$8=constants!$C$60,D226,F226))","v":1.7485000000000044},1,2.8470000000000026,2.6,2.6,{"$f":"IF(OR($B$22=constants!$B$60,AND(I226>$B$12,$B$12<>-1)),O225+(N226-O225)*$O$74,O225+(L226-O225)*$O$74)","v":2.6},2.58,2.6,2.6,2.6,2.6,2.6,2.6,2.6,2.6,2.5700000000000003,2.5649999999999999,2.56]
[1,1.5100000000000011,{"$f":"$D$19*B227+$D$20","v":2.8674400000000029},{"$f":"D226","v":1.7485000000000044},3.3444950000000007,3.3594950000000008,{"$f":"B227*$H$51+$H$52","v":2.8674400000000029},3.0034999999999998,{"$f":"IF($B$7=constants!$C$60,G227,IF($B$8=constants!$C$60,C227,E227))","v":2.8674400000000029},{"$f":"IF($B$7=constants!$C$60,H227,IF($B$8=constants!$C$60,D227,F227))","v":1.7485000000000044},1,2.8674400000000029,2.6,2.6,{"$f":"IF(OR($B$22=constants!$B$60,AND(I227>$B$12,$B$12<>-1)),O226+(N227-O226)*$O$74,O226+(L227-O226)*$O$74)","v":2.6},2.58,2.6,2.6,2.6,2.6,2.6,2.6,2.6,2.6,2.5700000000000003,2.5649999999999999,2.56]
[1,1.5200000000000011,2.8878800000000027,{"$f":"D227","v":1.7485000000000044},3.3492400000000004,3.3642400000000006,2.8878800000000027,3.0034999999999998,{"$f":"IF($B$7=constants!$C$60,G228,IF($B$8=constants!$C$60,C228,E228))","v":2.8878800000000027},{"$f":"IF($B$7=constants!$C$60,H228,IF($B$8=constants!$C$60,D228,F228))","v":1.7485000000000044},1,2.8878800000000027,2.6,2.6,{"$f":"IF(OR($B$22=constants!$B$60,AND(I228>$B$12,$B$12<>-1)),O227+(N228-O227)*$O$74,O227+(L228-O227)*$O$74)","v":2.6},2.58,2.6,2.6,2.6,2.6,2.6,2.6,2.6,2.6,2.5700000000000003,2.5649999999999999,2.56]
[1,1.5300000000000011,2.9083200000000029,1.7485000000000044,3.3539850000000007,3.3689850000000008,2.9083200000000029,3.0034999999999998,{"$f":"IF($B$7=constants!$C$60,G229,IF($B$8=constants!$C$60,C229,E229))","v":2.9083200000000029},{"$f":"IF($B$7=constants!$C$60,H229,IF($B$8=constants!$C$60,D229,F229))","v":1.7485000000000044},1,2.9083200000000029,2.6,2.6,{"$f":"IF(OR($B$22=constants!$B$60,AND(I229>$B$12,$B$12<>-1)),O228+(N229-O228)*$O$74,O228+(L229-O228)*$O$74)","v":2.6},2.58,2.6,2.6,2.6,2.6,2.6,2.6,2.6,2.6,2.5700000000000003,2.5649999999999999,2.56]
[1,1.5400000000000011,2.9287600000000027,1.7485000000000044,3.3587300000000004,3.3737300000000006,2.9287600000000027,3.0034999999999998,{"$f":"IF($B$7=constants!$C$60,G230,IF($B$8=constants!$C$60,C230,E230))","v":2.9287600000000027},{"$f":"IF($B$7=constants!$C$60,H230,IF($B$8=constants!$C$60,D230,F230))","v":1.7485000000000044},1,2.9287600000000027,2.6,2.6,{"$f":"IF(OR($B$22=constants!$B$60,AND(I230>$B$12,$B$12<>-1)),O229+(N230-O229)*$O$74,O229+(L230-O229)*$O$74)","v":2.6},2.58,2.6,2.6,2.6,2.6,2.6,2.6,2.6,2.6,2.5700000000000003,2.5649999999999999,2.56]
[1,1.5500000000000012,2.9492000000000029,1.7485000000000044,3.3634750000000007,3.3784750000000008,2.9492000000000029,3.0034999999999998,{"$f":"IF($B$7=constants!$C$60,G231,IF($B$8=constants!$C$60,C231,E231))","v":2.9492000000000029},{"$f":"IF($B$7=constants!$C$60,H231,IF($B$8=constants!$C$60,D231,F231))","v":1.7485000000000044},1,2.9492000000000029,2.6,2.6,{"$f":"IF(OR($B$22=constants!$B$60,AND(I231>$B$12,$B$12<>-1)),O230+(N231-O230)*$O$74,O230+(L231-O230)*$O$74)","v":2.6},2.58,2.6,2.6,2.6,2.6,2.6,2.6,2.6,2.6,2.5700000000000003,2.5649999999999999,2.56]
[1,1.5600000000000012,2.9696400000000027,1.7485000000000044,3.3682200000000004,3.3832200000000006,2.9696400000000027,3.0034999999999998,{"$f":"IF($B$7=constants!$C$60,G232,IF($B$8=constants!$C$60,C232,E232))","v":2.9696400000000027},{"$f":"IF($B$7=constants!$C$60,H232,IF($B$8=constants!$C$60,D232,F232))","v":1.7485000000000044},1,2.9696400000000027,2.6,2.6,{"$f":"IF(OR($B$22=constants!$B$60,AND(I232>$B$12,$B$12<>-1)),O231+(N232-O231)*$O$74,O231+(L232-O231)*$O$74)","v":2.6},2.58,2.6,2.6,2.6,2.6,2.6,2.6,2.6,2.6,2.5700000000000003,2.5649999999999999,2.56]
[1,1.5700000000000012,2.9900800000000025,1.7485000000000044,3.3729650000000007,3.3879650000000008,2.9900800000000025,3.0034999999999998,{"$f":"IF($B$7=constants!$C$60,G233,IF($B$8=constants!$C$60,C233,E233))","v":2.9900800000000025},{"$f":"IF($B$7=constants!$C$60,H233,IF($B$8=constants!$C$60,D233,F233))","v":1.7485000000000044},1,2.9900800000000025,2.6,2.6,{"$f":"IF(OR($B$22=constants!$B$60,AND(I233>$B$12,$B$12<>-1)),O232+(N233-O232)*$O$74,O232+(L233-O232)*$O$74)","v":2.6},2.58,2.6,2.6,2.6,2.6,2.6,2.6,2.6,2.6,2.5700000000000003,2.5649999999999999,2.56]
[1,1.5800000000000012,3.0105200000000027,1.7485000000000044,3.3777100000000004,3.3927100000000006,3.0105200000000027,3.0034999999999998,{"$f":"IF($B$7=constants!$C$60,G234,IF($B$8=constants!$C$60,C234,E234))","v":3.0105200000000027},{"$f":"IF($B$7=constants!$C$60,H234,IF($B$8=constants!$C$60,D234,F234))","v":1.7485000000000044},1,3.0105200000000027,2.6,2.6,{"$f":"IF(OR($B$22=constants!$B$60,AND(I234>$B$12,$B$12<>-1)),O233+(N234-O233)*$O$74,O233+(L234-O233)*$O$74)","v":2.6},2.58,2.6,2.6,2.6,2.6,2.6,2.6,2.6,2.6,2.5700000000000003,2.5649999999999999,2.56]
[1,1.5900000000000012,3.0309600000000025,1.7485000000000044,3.3824550000000007,3.3974550000000008,3.0309600000000025,3.0034999999999998,{"$f":"IF($B$7=constants!$C$60,G235,IF($B$8=constants!$C$60,C235,E235))","v":3.0309600000000025},{"$f":"IF($B$7=constants!$C$60,H235,IF($B$8=constants!$C$60,D235,F235))","v":1.7485000000000044},1,3.0309600000000025,2.6,2.6,{"$f":"IF(OR($B$22=constants!$B$60,AND(I235>$B$12,$B$12<>-1)),O234+(N235-O234)*$O$74,O234+(L235-O234)*$O$74)","v":2.6},2.58,2.6,2.6,2.6,2.6,2.6,2.6,2.6,2.6,2.5700000000000003,2.5649999999999999,2.56]
[1,1.6000000000000012,3.0514000000000028,1.7485000000000044,3.3872000000000004,3.4022000000000006,3.0514000000000028,3.0034999999999998,{"$f":"IF($B$7=constants!$C$60,G236,IF($B$8=constants!$C$60,C236,E236))","v":3.0514000000000028},{"$f":"IF($B$7=constants!$C$60,H236,IF($B$8=constants!$C$60,D236,F236))","v":1.7485000000000044},1,3.0514000000000028,2.6,2.6,{"$f":"IF(OR($B$22=constants!$B$60,AND(I236>$B$12,$B$12<>-1)),O235+(N236-O235)*$O$74,O235+(L236-O235)*$O$74)","v":2.6},2.58,2.6,2.6,2.6,2.6,2.6,2.6,2.6,2.6,2.5700000000000003,2.5649999999999999,2.56]
[1,1.6100000000000012,3.0718400000000026,1.7485000000000044,3.3919450000000007,3.4069450000000008,3.0718400000000026,3.0034999999999998,{"$f":"IF($B$7=constants!$C$60,G237,IF($B$8=constants!$C$60,C237,E237))","v":3.0718400000000026},{"$f":"IF($B$7=constants!$C$60,H237,IF($B$8=constants!$C$60,D237,F237))","v":1.7485000000000044},1,3.0718400000000026,2.6,2.6,{"$f":"IF(OR($B$22=constants!$B$60,AND(I237>$B$12,$B$12<>-1)),O236+(N237-O236)*$O$74,O236+(L237-O236)*$O$74)","v":2.6},2.58,2.6,2.6,{"$f":"S$72*IF(S$71=0,$L237,IF(S$71=1,$R237,IF($B$12=-1,$L237,IF($I237>$B$12,$R237,$L237))))","v":2.6},2.6,2.6,2.6,2.6,2.6,2.5700000000000003,2.5649999999999999,2.56]
[1,1.6200000000000012,3.0922800000000028,1.7485000000000044,3.3966900000000004,3.4116900000000006,3.0922800000000028,3.0034999999999998,{"$f":"IF($B$7=constants!$C$60,G238,IF($B$8=constants!$C$60,C238,E238))","v":3.0922800000000028},{"$f":"IF($B$7=constants!$C$60,H238,IF($B$8=constants!$C$60,D238,F238))","v":1.7485000000000044},1,3.0922800000000028,2.6,2.6,{"$f":"IF(OR($B$22=constants!$B$60,AND(I238>$B$12,$B$12<>-1)),O237+(N238-O237)*$O$74,O237+(L238-O237)*$O$74)","v":2.6},2.58,2.6,2.6,2.6,2.6,2.6,2.6,2.6,2.6,2.5700000000000003,2.5649999999999999,2.56]
[1,1.6300000000000012,3.1127200000000026,1.7485000000000044,3.4014350000000007,3.4164350000000008,3.1127200000000026,3.0034999999999998,{"$f":"IF($B$7=constants!$C$60,G239,IF($B$8=constants!$C$60,C239,E239))","v":3.1127200000000026},{"$f":"IF($B$7=constants!$C$60,H239,IF($B$8=constants!$C$60,D239,F239))","v":1.7485000000000044},1,3.1127200000000026,2.6,2.6,{"$f":"IF(OR($B$22=constants!$B$60,AND(I239>$B$12,$B$12<>-1)),O238+(N239-O238)*$O$74,O238+(L239-O238)*$O$74)","v":2.6},2.58,2.6,2.6,2.6,2.6,2.6,2.6,2.6,2.6,2.5700000000000003,2.5649999999999999,2.56]
[1,1.6400000000000012,3.1331600000000028,1.7485000000000044,3.4061800000000004,3.4211800000000006,3.1331600000000028,3.0034999999999998,{"$f":"IF($B$7=constants!$C$60,G240,IF($B$8=constants!$C$60,C240,E240))","v":3.1331600000000028},{"$f":"IF($B$7=constants!$C$60,H240,IF($B$8=constants!$C$60,D240,F240))","v":1.7485000000000044},1,{"$f":"IF($K240=0,IF($I240>$B$16,L239+($I240-L239)*L$74-J$72,L239-L239/L$74),IF($I240>$B$17,L239+($I240-L239)*L$74-J$72,L239-L239/L$74))","v":3.1331600000000028},2.6,2.6,{"$f":"IF(OR($B$22=constants!$B$60,AND(I240>$B$12,$B$12<>-1)),O239+(N240-O239)*$O$74,O239+(L240-O239)*$O$74)","v":2.6},2.58,{"$f":"IF($K240=0,IF($I240>$B$16,R239+($B$21-R239)*R$74-R$72,R239-R239/R$74),IF($I240>$B$17,R239+($B$21-R239)*R$74-R$72,R239-R239/R$74))","v":2.6},2.6,2.6,2.6,2.6,2.6,2.6,2.6,2.5700000000000003,2.5649999999999999,2.56]
[1,1.6500000000000012,3.1536000000000026,1.7485000000000044,3.4109250000000007,{"$f":"E241+$F$74","v":3.4259250000000008},3.1536000000000026,{"$f":"H240","v":3.0034999999999998},{"$f":"IF($B$7=constants!$C$60,G241,IF($B$8=constants!$C$60,C241,E241))","v":3.1536000000000026},{"$f":"IF($B$7=constants!$C$60,H241,IF($B$8=constants!$C$60,D241,F241))","v":1.7485000000000044},1,3.1536000000000026,2.6,2.6,{"$f":"IF(OR($B$22=constants!$B$60,AND(I241>$B$12,$B$12<>-1)),O240+(N241-O240)*$O$74,O240+(L241-O240)*$O$74)","v":2.6},2.58,2.6,2.6,2.6,2.6,2.6,2.6,2.6,2.6,2.5700000000000003,2.5649999999999999,2.56]
[1,1.6600000000000013,3.1740400000000029,1.7485000000000044,{"$f":"$K$11*$B242+$K$12","v":3.4156700000000004},3.4306700000000006,3.1740400000000029,3.0034999999999998,{"$f":"IF($B$7=constants!$C$60,G242,IF($B$8=constants!$C$60,C242,E242))","v":3.1740400000000029},{"$f":"IF($B$7=constants!$C$60,H242,IF($B$8=constants!$C$60,D242,F242))","v":1.7485000000000044},1,3.1740400000000029,{"$f":"IF($K242=0,IF($I242>$B$16,M241+($B$20-M241)*M$74-K$72,M241-M241/M$74),IF($I242>$B$17,M241+($B$20-M241)*M$74-K$72,M241-M241/M$74))","v":2.6},2.6,{"$f":"IF(OR($B$22=constants!$B$60,AND(I242>$B$12,$B$12<>-1)),O241+(N242-O241)*$O$74,O241+(L242-O241)*$O$74)","v":2.6},2.58,2.6,2.6,2.6,2.6,2.6,2.6,2.6,2.6,2.5700000000000003,2.5649999999999999,2.56]
[1,1.6700000000000013,3.1944800000000027,1.7485000000000044,3.4204150000000006,3.4354150000000008,3.1944800000000027,3.0034999999999998,{"$f":"IF($B$7=constants!$C$60,G243,IF($B$8=constants!$C$60,C243,E243))","v":3.1944800000000027},{"$f":"IF($B$7=constants!$C$60,H243,IF($B$8=constants!$C$60,D243,F243))","v":1.7485000000000044},1,3.1944800000000027,2.6,2.6,{"$f":"IF(OR($B$22=constants!$B$60,AND(I243>$B$12,$B$12<>-1)),O242+(N243-O242)*$O$74,O242+(L243-O242)*$O$74)","v":2.6},2.58,2.6,2.6,2.6,2.6,2.6,2.6,2.6,2.6,2.5700000000000003,2.5649999999999999,2.56]
[1,1.6800000000000013,3.2149200000000029,1.7485000000000044,3.4251600000000004,3.4401600000000006,3.2149200000000029,3.0034999999999998,{"$f":"IF($B$7=constants!$C$60,G244,IF($B$8=constants!$C$60,C244,E244))","v":3.2149200000000029},{"$f":"IF($B$7=constants!$C$60,H244,IF($B$8=constants!$C$60,D244,F244))","v":1.7485000000000044},1,3.2149200000000029,2.6,2.6,{"$f":"IF(OR($B$22=constants!$B$60,AND(I244>$B$12,$B$12<>-1)),O243+(N244-O243)*$O$74,O243+(L244-O243)*$O$74)","v":2.6},2.58,2.6,2.6,2.6,2.6,2.6,2.6,2.6,2.6,2.5700000000000003,2.5649999999999999,2.56]
[1,1.6900000000000013,3.2353600000000027,1.7485000000000044,3.4299050000000006,3.4449050000000008,3.2353600000000027,3.0034999999999998,{"$f":"IF($B$7=constants!$C$60,G245,IF($B$8=constants!$C$60,C245,E245))","v":3.2353600000000027},{"$f":"IF($B$7=constants!$C$60,H245,IF($B$8=constants!$C$60,D245,F245))","v":1.7485000000000044},1,3.2353600000000027,2.6,2.6,{"$f":"IF(OR($B$22=constants!$B$60,AND(I245>$B$12,$B$12<>-1)),O244+(N245-O244)*$O$74,O244+(L245-O244)*$O$74)","v":2.6},2.58,2.6,2.6,2.6,2.6,2.6,2.6,2.6,2.6,2.5700000000000003,2.5649999999999999,2.56]
[1,1.7000000000000013,3.2558000000000029,1.7485000000000044,3.4346500000000004,3.4496500000000005,3.2558000000000029,3.0034999999999998,{"$f":"IF($B$7=constants!$C$60,G246,IF($B$8=constants!$C$60,C246,E246))","v":3.2558000000000029},{"$f":"IF($B$7=constants!$C$60,H246,IF($B$8=constants!$C$60,D246,F246))","v":1.7485000000000044},1,3.2558000000000029,2.6,2.6,{"$f":"IF(OR($B$22=constants!$B$60,AND(I246>$B$12,$B$12<>-1)),O245+(N246-O245)*$O$74,O245+(L246-O245)*$O$74)","v":2.6},2.58,2.6,2.6,2.6,2.6,2.6,2.6,2.6,2.6,2.5700000000000003,2.5649999999999999,2.56]
[1,1.7100000000000013,3.2762400000000027,1.7485000000000044,3.4393950000000006,3.4543950000000008,3.2762400000000027,3.0034999999999998,{"$f":"IF($B$7=constants!$C$60,G247,IF($B$8=constants!$C$60,C247,E247))","v":3.2762400000000027},{"$f":"IF($B$7=constants!$C$60,H247,IF($B$8=constants!$C$60,D247,F247))","v":1.7485000000000044},1,3.2762400000000027,2.6,2.6,{"$f":"IF(OR($B$22=constants!$B$60,AND(I247>$B$12,$B$12<>-1)),O246+(N247-O246)*$O$74,O246+(L247-O246)*$O$74)","v":2.6},2.58,2.6,2.6,2.6,2.6,2.6,2.6,2.6,2.6,2.5700000000000003,2.5649999999999999,2.56]
[1,1.7200000000000013,3.2966800000000029,1.7485000000000044,3.4441400000000009,3.459140000000001,3.2966800000000029,3.0034999999999998,{"$f":"IF($B$7=constants!$C$60,G248,IF($B$8=constants!$C$60,C248,E248))","v":3.2966800000000029},{"$f":"IF($B$7=constants!$C$60,H248,IF($B$8=constants!$C$60,D248,F248))","v":1.7485000000000044},1,3.2966800000000029,2.6,2.6,{"$f":"IF(OR($B$22=constants!$B$60,AND(I248>$B$12,$B$12<>-1)),O247+(N248-O247)*$O$74,O247+(L248-O247)*$O$74)","v":2.6},2.58,2.6,2.6,2.6,2.6,2.6,2.6,2.6,2.6,2.5700000000000003,2.5649999999999999,2.56]
[1,1.7300000000000013,3.3171200000000027,1.7485000000000044,3.4488850000000006,3.4638850000000008,3.3171200000000027,3.0034999999999998,{"$f":"IF($B$7=constants!$C$60,G249,IF($B$8=constants!$C$60,C249,E249))","v":3.3171200000000027},{"$f":"IF($B$7=constants!$C$60,H249,IF($B$8=constants!$C$60,D249,F249))","v":1.7485000000000044},1,3.3171200000000027,2.6,2.6,{"$f":"IF(OR($B$22=constants!$B$60,AND(I249>$B$12,$B$12<>-1)),O248+(N249-O248)*$O$74,O248+(L249-O248)*$O$74)","v":2.6},2.58,2.6,2.6,2.6,2.6,2.6,2.6,2.6,2.6,2.5700000000000003,2.5649999999999999,2.56]
[1,1.7400000000000013,3.337560000000003,1.7485000000000044,3.4536300000000004,3.4686300000000005,3.337560000000003,3.0034999999999998,{"$f":"IF($B$7=constants!$C$60,G250,IF($B$8=constants!$C$60,C250,E250))","v":3.337560000000003},{"$f":"IF($B$7=constants!$C$60,H250,IF($B$8=constants!$C$60,D250,F250))","v":1.7485000000000044},1,3.337560000000003,2.6,2.6,{"$f":"IF(OR($B$22=constants!$B$60,AND(I250>$B$12,$B$12<>-1)),O249+(N250-O249)*$O$74,O249+(L250-O249)*$O$74)","v":2.6},2.58,2.6,2.6,2.6,2.6,2.6,2.6,2.6,2.6,2.5700000000000003,2.5649999999999999,2.56]
[1,1.7500000000000013,{"$f":"$D$23*B251+$D$24","v":3.3579999999999974},{"$f":"$G$23*$B251+$G$24","v":1.7485000000000062},3.4583750000000006,3.4733750000000008,{"$f":"B251*$H$56+$H$57","v":3.3579999999999974},3.0034999999999998,{"$f":"IF($B$7=constants!$C$60,G251,IF($B$8=constants!$C$60,C251,E251))","v":3.3579999999999974},{"$f":"IF($B$7=constants!$C$60,H251,IF($B$8=constants!$C$60,D251,F251))","v":1.7485000000000062},1,3.3579999999999974,2.6,2.6,{"$f":"IF(OR($B$22=constants!$B$60,AND(I251>$B$12,$B$12<>-1)),O250+(N251-O250)*$O$74,O250+(L251-O250)*$O$74)","v":2.6},2.58,2.6,2.6,2.6,2.6,2.6,2.6,2.6,2.6,2.5700000000000003,2.5649999999999999,2.56]
[1,1.7600000000000013,{"$f":"$D$23*B252+$D$24","v":3.3375599999999972},{"$f":"$G$23*$B252+$G$24","v":1.7924400000000063},3.4631200000000009,3.478120000000001,{"$f":"B252*$H$56+$H$57","v":3.3432199999999974},3.0034999999999998,{"$f":"IF($B$7=constants!$C$60,G252,IF($B$8=constants!$C$60,C252,E252))","v":3.3375599999999972},{"$f":"IF($B$7=constants!$C$60,H252,IF($B$8=constants!$C$60,D252,F252))","v":1.7924400000000063},1,3.3375599999999972,2.6,2.6,{"$f":"IF(OR($B$22=constants!$B$60,AND(I252>$B$12,$B$12<>-1)),O251+(N252-O251)*$O$74,O251+(L252-O251)*$O$74)","v":2.6},2.58,2.6,2.6,2.6,2.6,2.6,2.6,2.6,2.6,2.5700000000000003,2.5649999999999999,2.56]
[1,1.7700000000000014,3.3171199999999974,1.8363800000000063,3.4678650000000006,3.4828650000000008,3.3284399999999974,3.0034999999999998,{"$f":"IF($B$7=constants!$C$60,G253,IF($B$8=constants!$C$60,C253,E253))","v":3.3171199999999974},{"$f":"IF($B$7=constants!$C$60,H253,IF($B$8=constants!$C$60,D253,F253))","v":1.8363800000000063},1,3.3171199999999974,2.6,2.6,{"$f":"IF(OR($B$22=constants!$B$60,AND(I253>$B$12,$B$12<>-1)),O252+(N253-O252)*$O$74,O252+(L253-O252)*$O$74)","v":2.6},2.58,2.6,2.6,2.6,2.6,2.6,2.6,2.6,2.6,2.5700000000000003,2.5649999999999999,2.56]
[1,1.7800000000000014,3.2966799999999972,1.8803200000000064,3.4726100000000004,3.4876100000000005,3.3136599999999974,3.0034999999999998,{"$f":"IF($B$7=constants!$C$60,G254,IF($B$8=constants!$C$60,C254,E254))","v":3.2966799999999972},{"$f":"IF($B$7=constants!$C$60,H254,IF($B$8=constants!$C$60,D254,F254))","v":1.8803200000000064},1,3.2966799999999972,2.6,2.6,{"$f":"IF(OR($B$22=constants!$B$60,AND(I254>$B$12,$B$12<>-1)),O253+(N254-O253)*$O$74,O253+(L254-O253)*$O$74)","v":2.6},2.58,2.6,2.6,2.6,2.6,2.6,2.6,2.6,2.6,2.5700000000000003,2.5649999999999999,2.56]
[1,1.7900000000000014,3.2762399999999974,1.9242600000000065,3.4773550000000006,3.4923550000000008,3.2988799999999974,3.0034999999999998,{"$f":"IF($B$7=constants!$C$60,G255,IF($B$8=constants!$C$60,C255,E255))","v":3.2762399999999974},{"$f":"IF($B$7=constants!$C$60,H255,IF($B$8=constants!$C$60,D255,F255))","v":1.9242600000000065},1,3.2762399999999974,2.6,2.6,{"$f":"IF(OR($B$22=constants!$B$60,AND(I255>$B$12,$B$12<>-1)),O254+(N255-O254)*$O$74,O254+(L255-O254)*$O$74)","v":2.6},2.58,2.6,2.6,2.6,2.6,2.6,2.6,2.6,2.6,2.5700000000000003,2.5649999999999999,2.56]
[1,1.8000000000000014,3.2557999999999971,1.9682000000000066,3.4821000000000009,3.497100000000001,3.2840999999999974,3.0034999999999998,{"$f":"IF($B$7=constants!$C$60,G256,IF($B$8=constants!$C$60,C256,E256))","v":3.2557999999999971},{"$f":"IF($B$7=constants!$C$60,H256,IF($B$8=constants!$C$60,D256,F256))","v":1.9682000000000066},1,3.2557999999999971,2.6,2.6,{"$f":"IF(OR($B$22=constants!$B$60,AND(I256>$B$12,$B$12<>-1)),O255+(N256-O255)*$O$74,O255+(L256-O255)*$O$74)","v":2.6},2.58,2.6,2.6,2.6,2.6,2.6,2.6,2.6,2.6,2.5700000000000003,2.5649999999999999,2.56]
[1,1.8100000000000014,3.2353599999999973,2.0121400000000067,3.4868450000000006,3.5018450000000008,3.2693199999999973,3.0034999999999998,{"$f":"IF($B$7=constants!$C$60,G257,IF($B$8=constants!$C$60,C257,E257))","v":3.2353599999999973},{"$f":"IF($B$7=constants!$C$60,H257,IF($B$8=constants!$C$60,D257,F257))","v":2.0121400000000067},1,3.2353599999999973,2.6,2.6,{"$f":"IF(OR($B$22=constants!$B$60,AND(I257>$B$12,$B$12<>-1)),O256+(N257-O256)*$O$74,O256+(L257-O256)*$O$74)","v":2.6},2.58,2.6,2.6,2.6,2.6,2.6,2.6,2.6,2.6,2.5700000000000003,2.5649999999999999,2.56]
[1,1.8200000000000014,3.2149199999999976,2.0560800000000068,3.4915900000000004,3.5065900000000005,3.2545399999999973,3.0034999999999998,{"$f":"IF($B$7=constants!$C$60,G258,IF($B$8=constants!$C$60,C258,E258))","v":3.2149199999999976},{"$f":"IF($B$7=constants!$C$60,H258,IF($B$8=constants!$C$60,D258,F258))","v":2.0560800000000068},1,3.2149199999999976,2.6,{"$f":"IF(M258>I258,L258,M258)","v":2.6},{"$f":"IF(OR($B$22=constants!$B$60,AND(I258>$B$12,$B$12<>-1)),O257+(N258-O257)*$O$74,O257+(L258-O257)*$O$74)","v":2.6},2.58,2.6,2.6,2.6,2.6,2.6,2.6,2.6,2.6,2.5700000000000003,2.5649999999999999,2.56]
[1,1.8300000000000014,3.1944799999999973,2.1000200000000069,3.4963350000000006,3.5113350000000008,3.2397599999999973,3.0034999999999998,{"$f":"IF($B$7=constants!$C$60,G259,IF($B$8=constants!$C$60,C259,E259))","v":3.1944799999999973},{"$f":"IF($B$7=constants!$C$60,H259,IF($B$8=constants!$C$60,D259,F259))","v":2.1000200000000069},1,3.1944799999999973,2.6,2.6,{"$f":"IF(OR($B$22=constants!$B$60,AND(I259>$B$12,$B$12<>-1)),O258+(N259-O258)*$O$74,O258+(L259-O258)*$O$74)","v":2.6},2.58,2.6,2.6,2.6,2.6,2.6,2.6,2.6,2.6,2.5700000000000003,2.5649999999999999,2.56]
[1,1.8400000000000014,3.1740399999999975,2.1439600000000061,3.5010800000000009,3.516080000000001,3.2249799999999973,3.0034999999999998,{"$f":"IF($B$7=constants!$C$60,G260,IF($B$8=constants!$C$60,C260,E260))","v":3.1740399999999975},{"$f":"IF($B$7=constants!$C$60,H260,IF($B$8=constants!$C$60,D260,F260))","v":2.1439600000000061},1,3.1740399999999975,2.6,2.6,{"$f":"IF(OR($B$22=constants!$B$60,AND(I260>$B$12,$B$12<>-1)),O259+(N260-O259)*$O$74,O259+(L260-O259)*$O$74)","v":2.6},2.58,2.6,2.6,2.6,2.6,2.6,2.6,2.6,2.6,2.5700000000000003,2.5649999999999999,2.56]
[1,1.8500000000000014,3.1535999999999973,2.1879000000000071,3.5058250000000006,3.5208250000000008,3.2101999999999973,3.0034999999999998,{"$f":"IF($B$7=constants!$C$60,G261,IF($B$8=constants!$C$60,C261,E261))","v":3.1535999999999973},{"$f":"IF($B$7=constants!$C$60,H261,IF($B$8=constants!$C$60,D261,F261))","v":2.1879000000000071},1,3.1535999999999973,2.6,2.6,{"$f":"IF(OR($B$22=constants!$B$60,AND(I261>$B$12,$B$12<>-1)),O260+(N261-O260)*$O$74,O260+(L261-O260)*$O$74)","v":2.6},2.58,2.6,2.6,2.6,2.6,2.6,2.6,2.6,2.6,2.5700000000000003,2.5649999999999999,2.56]
[1,1.8600000000000014,3.1331599999999975,2.2318400000000063,3.5105700000000004,3.5255700000000005,3.1954199999999973,3.0034999999999998,{"$f":"IF($B$7=constants!$C$60,G262,IF($B$8=constants!$C$60,C262,E262))","v":3.1331599999999975},{"$f":"IF($B$7=constants!$C$60,H262,IF($B$8=constants!$C$60,D262,F262))","v":2.2318400000000063},1,3.1331599999999975,2.6,2.6,{"$f":"IF(OR($B$22=constants!$B$60,AND(I262>$B$12,$B$12<>-1)),O261+(N262-O261)*$O$74,O261+(L262-O261)*$O$74)","v":2.6},2.58,2.6,2.6,2.6,2.6,2.6,2.6,2.6,2.6,2.5700000000000003,2.5649999999999999,2.56]
[1,1.8700000000000014,3.1127199999999973,2.2757800000000072,3.5153150000000006,3.5303150000000008,3.1806399999999972,3.0034999999999998,{"$f":"IF($B$7=constants!$C$60,G263,IF($B$8=constants!$C$60,C263,E263))","v":3.1127199999999973},{"$f":"IF($B$7=constants!$C$60,H263,IF($B$8=constants!$C$60,D263,F263))","v":2.2757800000000072},1,3.1127199999999973,2.6,2.6,{"$f":"IF(OR($B$22=constants!$B$60,AND(I263>$B$12,$B$12<>-1)),O262+(N263-O262)*$O$74,O262+(L263-O262)*$O$74)","v":2.6},2.58,2.6,2.6,2.6,2.6,2.6,2.6,2.6,2.6,2.5700000000000003,2.5649999999999999,2.56]
[1,1.8800000000000014,3.0922799999999975,2.3197200000000064,3.5200600000000009,3.535060000000001,3.1658599999999972,3.0034999999999998,{"$f":"IF($B$7=constants!$C$60,G264,IF($B$8=constants!$C$60,C264,E264))","v":3.0922799999999975},{"$f":"IF($B$7=constants!$C$60,H264,IF($B$8=constants!$C$60,D264,F264))","v":2.3197200000000064},1,3.0922799999999975,2.6,2.6,{"$f":"IF(OR($B$22=constants!$B$60,AND(I264>$B$12,$B$12<>-1)),O263+(N264-O263)*$O$74,O263+(L264-O263)*$O$74)","v":2.6},2.58,2.6,2.6,2.6,2.6,2.6,2.6,2.6,2.6,2.5700000000000003,2.5649999999999999,2.56]
[1,1.8900000000000015,3.0718399999999972,2.3636600000000074,3.5248050000000006,3.5398050000000008,3.1510799999999972,3.0034999999999998,{"$f":"IF($B$7=constants!$C$60,G265,IF($B$8=constants!$C$60,C265,E265))","v":3.0718399999999972},{"$f":"IF($B$7=constants!$C$60,H265,IF($B$8=constants!$C$60,D265,F265))","v":2.3636600000000074},1,3.0718399999999972,2.6,2.6,{"$f":"IF(OR($B$22=constants!$B$60,AND(I265>$B$12,$B$12<>-1)),O264+(N265-O264)*$O$74,O264+(L265-O264)*$O$74)","v":2.6},2.58,2.6,2.6,2.6,2.6,2.6,2.6,2.6,2.6,2.5700000000000003,2.5649999999999999,2.56]
[1,1.9000000000000015,3.0513999999999974,2.4076000000000066,3.5295500000000004,3.5445500000000005,3.1362999999999972,3.0034999999999998,{"$f":"IF($B$7=constants!$C$60,G266,IF($B$8=constants!$C$60,C266,E266))","v":3.0513999999999974},{"$f":"IF($B$7=constants!$C$60,H266,IF($B$8=constants!$C$60,D266,F266))","v":2.4076000000000066},1,3.0513999999999974,2.6,2.6,{"$f":"IF(OR($B$22=constants!$B$60,AND(I266>$B$12,$B$12<>-1)),O265+(N266-O265)*$O$74,O265+(L266-O265)*$O$74)","v":2.6},2.58,2.6,2.6,2.6,2.6,2.6,2.6,2.6,2.6,2.5700000000000003,2.5649999999999999,2.56]
[1,1.9100000000000015,3.0309599999999972,2.4515400000000076,3.5342950000000006,3.5492950000000008,3.1215199999999972,3.0034999999999998,{"$f":"IF($B$7=constants!$C$60,G267,IF($B$8=constants!$C$60,C267,E267))","v":3.0309599999999972},{"$f":"IF($B$7=constants!$C$60,H267,IF($B$8=constants!$C$60,D267,F267))","v":2.4515400000000076},1,3.0309599999999972,2.6,2.6,{"$f":"IF(OR($B$22=constants!$B$60,AND(I267>$B$12,$B$12<>-1)),O266+(N267-O266)*$O$74,O266+(L267-O266)*$O$74)","v":2.6},2.58,2.6,2.6,2.6,2.6,2.6,2.6,2.6,2.6,2.5700000000000003,2.5649999999999999,2.56]
[1,1.9200000000000015,3.0105199999999974,2.4954800000000068,3.5390400000000009,3.554040000000001,3.1067399999999972,3.0034999999999998,{"$f":"IF($B$7=constants!$C$60,G268,IF($B$8=constants!$C$60,C268,E268))","v":3.0105199999999974},{"$f":"IF($B$7=constants!$C$60,H268,IF($B$8=constants!$C$60,D268,F268))","v":2.4954800000000068},1,3.0105199999999974,2.6,2.6,{"$f":"IF(OR($B$22=constants!$B$60,AND(I268>$B$12,$B$12<>-1)),O267+(N268-O267)*$O$74,O267+(L268-O267)*$O$74)","v":2.6},2.58,2.6,2.6,2.6,2.6,2.6,2.6,2.6,2.6,2.5700000000000003,2.5649999999999999,2.56]
[{"$f":"IF(B269<=100,1,IF(B269<=200,2,3))","v":1},1.9300000000000015,2.9900799999999972,2.5394200000000078,3.5437850000000006,3.5587850000000008,3.0919599999999972,3.0034999999999998,{"$f":"IF($B$7=constants!$C$60,G269,IF($B$8=constants!$C$60,C269,E269))","v":2.9900799999999972},{"$f":"IF($B$7=constants!$C$60,H269,IF($B$8=constants!$C$60,D269,F269))","v":2.5394200000000078},1,2.9900799999999972,2.6,2.6,{"$f":"IF(OR($B$22=constants!$B$60,AND(I269>$B$12,$B$12<>-1)),O268+(N269-O268)*$O$74,O268+(L269-O268)*$O$74)","v":2.6},{"$f":"IF(O269=0,0,O269-$P$72)","v":2.58},2.6,2.6,{"$f":"S$72*IF(S$71=0,$L269,IF(S$71=1,$R269,IF($B$12=-1,$L269,IF($I269>$B$12,$R269,$L269))))","v":2.6},2.6,2.6,2.6,2.6,2.6,{"$f":"IF(V269=0,0,V269-Y$72)","v":2.5700000000000003},{"$f":"IF(W269=0,0,W269-Z$72)","v":2.5649999999999999},{"$f":"IF(X269=0,0,X269-AA$72)","v":2.56}]
[1,{"$f":"B269+0.01","v":1.9400000000000015},2.9696399999999974,2.583360000000007,3.5485300000000004,3.5635300000000005,3.0771799999999971,3.0034999999999998,{"$f":"IF($B$7=constants!$C$60,G270,IF($B$8=constants!$C$60,C270,E270))","v":2.9696399999999974},{"$f":"IF($B$7=constants!$C$60,H270,IF($B$8=constants!$C$60,D270,F270))","v":2.583360000000007},{"$f":"IF(AND(I270>$B$16,K269=0),1,IF(AND(I270<$B$17,K269=1),0,K269))","v":1},2.9696399999999974,2.6,2.6,{"$f":"IF(OR($B$22=constants!$B$60,AND(I270>$B$12,$B$12<>-1)),O269+(N270-O269)*$O$74,O269+(L270-O269)*$O$74)","v":2.6},2.58,2.6,{"$f":"IF(Q270>I270,I270,Q270)","v":2.6},2.6,2.6,2.6,{"$f":"V269+(S270-V$72-V269)*V$74","v":2.6},{"$f":"W269+(T270-W$72-W269)*W$74","v":2.6},{"$f":"X269+(U270-X$72-X269)*X$74","v":2.6},2.5700000000000003,2.5649999999999999,2.56]
[1,1.9500000000000015,2.9491999999999972,2.6273000000000062,3.5532750000000006,3.5682750000000008,3.0623999999999971,3.0034999999999998,{"$f":"IF($B$7=constants!$C$60,G271,IF($B$8=constants!$C$60,C271,E271))","v":2.9491999999999972},{"$f":"IF($B$7=constants!$C$60,H271,IF($B$8=constants!$C$60,D271,F271))","v":2.6273000000000062},1,2.9491999999999972,2.6,2.6,{"$f":"IF(OR($B$22=constants!$B$60,AND(I271>$B$12,$B$12<>-1)),O270+(N271-O270)*$O$74,O270+(L271-O270)*$O$74)","v":2.6},2.58,2.6,2.6,2.6,2.6,2.6,2.6,2.6,2.6,2.5700000000000003,2.5649999999999999,2.56]
[1,1.9600000000000015,2.9287599999999969,2.6712400000000072,3.5580200000000008,3.573020000000001,3.0476199999999971,3.0034999999999998,{"$f":"IF($B$7=constants!$C$60,G272,IF($B$8=constants!$C$60,C272,E272))","v":2.9287599999999969},{"$f":"IF($B$7=constants!$C$60,H272,IF($B$8=constants!$C$60,D272,F272))","v":2.6712400000000072},1,2.9287599999999969,2.6,2.6,{"$f":"IF(OR($B$22=constants!$B$60,AND(I272>$B$12,$B$12<>-1)),O271+(N272-O271)*$O$74,O271+(L272-O271)*$O$74)","v":2.6},2.58,2.6,2.6,2.6,2.6,2.6,2.6,2.6,2.6,2.5700000000000003,2.5649999999999999,2.56]
[1,1.9700000000000015,2.9083199999999971,2.7151800000000064,3.5627650000000006,{"$f":"E273+$F$74","v":3.5777650000000008},3.0328399999999971,3.0034999999999998,{"$f":"IF($B$7=constants!$C$60,G273,IF($B$8=constants!$C$60,C273,E273))","v":2.9083199999999971},{"$f":"IF($B$7=constants!$C$60,H273,IF($B$8=constants!$C$60,D273,F273))","v":2.7151800000000064},1,2.9083199999999971,2.6,2.6,{"$f":"IF(OR($B$22=constants!$B$60,AND(I273>$B$12,$B$12<>-1)),O272+(N273-O272)*$O$74,O272+(L273-O272)*$O$74)","v":2.6},2.58,2.6,2.6,2.6,2.6,2.6,2.6,2.6,2.6,2.5700000000000003,2.5649999999999999,2.56]
[1,1.9800000000000015,2.8878799999999973,2.7591200000000073,3.5675100000000008,3.582510000000001,3.0180599999999971,3.0034999999999998,{"$f":"IF($B$7=constants!$C$60,G274,IF($B$8=constants!$C$60,C274,E274))","v":2.8878799999999973},{"$f":"IF($B$7=constants!$C$60,H274,IF($B$8=constants!$C$60,D274,F274))","v":2.7591200000000073},1,2.8878799999999973,2.6,2.6,{"$f":"IF(OR($B$22=constants!$B$60,AND(I274>$B$12,$B$12<>-1)),O273+(N274-O273)*$O$74,O273+(L274-O273)*$O$74)","v":2.6},2.58,2.6,2.6,2.6,2.6,2.6,2.6,2.6,2.6,2.5700000000000003,2.5649999999999999,2.56]
[1,1.9900000000000015,2.8674399999999975,2.8030600000000065,3.5722550000000006,3.5872550000000007,3.0032799999999971,3.0034999999999998,{"$f":"IF($B$7=constants!$C$60,G275,IF($B$8=constants!$C$60,C275,E275))","v":2.8674399999999975},{"$f":"IF($B$7=constants!$C$60,H275,IF($B$8=constants!$C$60,D275,F275))","v":2.8030600000000065},1,2.8674399999999975,2.6,2.6,{"$f":"IF(OR($B$22=constants!$B$60,AND(I275>$B$12,$B$12<>-1)),O274+(N275-O274)*$O$74,O274+(L275-O274)*$O$74)","v":2.6},2.58,2.6,2.6,2.6,2.6,2.6,2.6,2.6,2.6,2.5700000000000003,2.5649999999999999,2.56]
[1,2.0000000000000013,{"$f":"$D$29*B276+$D$30","v":2.8470000000000031},2.8470000000000057,{"$f":"$K$15*$B276+$K$16","v":3.5769999999999995},3.5919999999999996,2.9884999999999975,{"$f":"$H$63*B276+$H$64","v":3.0034999999999998},{"$f":"IF($B$7=constants!$C$60,G276,IF($B$8=constants!$C$60,C276,E276))","v":2.8470000000000031},{"$f":"IF($B$7=constants!$C$60,H276,IF($B$8=constants!$C$60,D276,F276))","v":2.8470000000000057},1,2.8470000000000031,2.6,2.6,{"$f":"IF(OR($B$22=constants!$B$60,AND(I276>$B$12,$B$12<>-1)),O275+(N276-O275)*$O$74,O275+(L276-O275)*$O$74)","v":2.6},2.58,2.6,2.6,2.6,2.6,2.6,2.6,2.6,2.6,2.5700000000000003,2.5649999999999999,2.56]
[1,2.0100000000000011,{"$f":"$D$29*B277+$D$30","v":2.8762000000000025},{"$f":"C277+$D$74","v":2.8912000000000027},{"$f":"$K$15*$B277+$K$16","v":3.5726199999999997},3.5876199999999998,{"$f":"(H277-$H$74)/(1-EXP(-1/G$74))*(1-EXP(-$B277/G$74))","v":2.9874999999999994},3.0024999999999995,{"$f":"IF($B$7=constants!$C$60,G277,IF($B$8=constants!$C$60,C277,E277))","v":2.8762000000000025},{"$f":"IF($B$7=constants!$C$60,H277,IF($B$8=constants!$C$60,D277,F277))","v":2.8912000000000027},1,2.8762000000000025,2.6,2.6,{"$f":"IF(OR($B$22=constants!$B$60,AND(I277>$B$12,$B$12<>-1)),O276+(N277-O276)*$O$74,O276+(L277-O276)*$O$74)","v":2.6},2.58,2.6,2.6,2.6,2.6,2.6,2.6,2.6,2.6,2.5700000000000003,2.5649999999999999,2.56]
[1,2.0200000000000009,2.905400000000002,2.9204000000000021,3.5682399999999994,3.5832399999999995,{"$f":"(H278-$H$74)/(1-EXP(-1/G$74))*(1-EXP(-$B278/G$74))","v":2.9864999999999995},3.0014999999999996,{"$f":"IF($B$7=constants!$C$60,G278,IF($B$8=constants!$C$60,C278,E278))","v":2.905400000000002},{"$f":"IF($B$7=constants!$C$60,H278,IF($B$8=constants!$C$60,D278,F278))","v":2.9204000000000021},1,2.905400000000002,2.6,2.6,{"$f":"IF(OR($B$22=constants!$B$60,AND(I278>$B$12,$B$12<>-1)),O277+(N278-O277)*$O$74,O277+(L278-O277)*$O$74)","v":2.6},2.58,2.6,2.6,2.6,2.6,2.6,2.6,2.6,2.6,2.5700000000000003,2.5649999999999999,2.56]
[1,2.0300000000000007,2.9346000000000014,2.9496000000000016,3.5638599999999996,3.5788599999999997,2.9854999999999996,3.0004999999999997,{"$f":"IF($B$7=constants!$C$60,G279,IF($B$8=constants!$C$60,C279,E279))","v":2.9346000000000014},{"$f":"IF($B$7=constants!$C$60,H279,IF($B$8=constants!$C$60,D279,F279))","v":2.9496000000000016},1,2.9346000000000014,2.6,2.6,{"$f":"IF(OR($B$22=constants!$B$60,AND(I279>$B$12,$B$12<>-1)),O278+(N279-O278)*$O$74,O278+(L279-O278)*$O$74)","v":2.6},2.58,2.6,2.6,2.6,2.6,2.6,2.6,2.6,2.6,2.5700000000000003,2.5649999999999999,2.56]
[1,2.0400000000000005,2.9638000000000009,2.978800000000001,3.5594799999999998,3.5744799999999999,2.9844999999999997,2.9994999999999998,{"$f":"IF($B$7=constants!$C$60,G280,IF($B$8=constants!$C$60,C280,E280))","v":2.9638000000000009},{"$f":"IF($B$7=constants!$C$60,H280,IF($B$8=constants!$C$60,D280,F280))","v":2.978800000000001},1,2.9638000000000009,2.6,2.6,{"$f":"IF(OR($B$22=constants!$B$60,AND(I280>$B$12,$B$12<>-1)),O279+(N280-O279)*$O$74,O279+(L280-O279)*$O$74)","v":2.6},2.58,2.6,2.6,2.6,2.6,2.6,2.6,2.6,2.6,2.5700000000000003,2.5649999999999999,2.56]
[1,2.0500000000000003,2.9930000000000003,3.0080000000000005,3.5550999999999999,3.5701000000000001,2.9834999999999998,2.9984999999999999,{"$f":"IF($B$7=constants!$C$60,G281,IF($B$8=constants!$C$60,C281,E281))","v":2.9930000000000003},{"$f":"IF($B$7=constants!$C$60,H281,IF($B$8=constants!$C$60,D281,F281))","v":3.0080000000000005},1,2.9930000000000003,2.6,2.6,{"$f":"IF(OR($B$22=constants!$B$60,AND(I281>$B$12,$B$12<>-1)),O280+(N281-O280)*$O$74,O280+(L281-O280)*$O$74)","v":2.6},2.58,2.6,2.6,2.6,2.6,2.6,2.6,2.6,2.6,2.5700000000000003,2.5649999999999999,2.56]
[1,2.06,3.0221999999999998,3.0371999999999999,3.5507200000000001,3.5657200000000002,2.9824999999999995,2.9974999999999996,{"$f":"IF($B$7=constants!$C$60,G282,IF($B$8=constants!$C$60,C282,E282))","v":3.0221999999999998},{"$f":"IF($B$7=constants!$C$60,H282,IF($B$8=constants!$C$60,D282,F282))","v":3.0371999999999999},1,3.0221999999999998,2.6,2.6,{"$f":"IF(OR($B$22=constants!$B$60,AND(I282>$B$12,$B$12<>-1)),O281+(N282-O281)*$O$74,O281+(L282-O281)*$O$74)","v":2.6},2.58,2.6,2.6,2.6,2.6,2.6,2.6,2.6,2.6,2.5700000000000003,2.5649999999999999,2.56]
[1,2.0699999999999998,3.0513999999999992,3.0663999999999993,3.5463399999999998,3.56134,2.9814999999999996,2.9964999999999997,{"$f":"IF($B$7=constants!$C$60,G283,IF($B$8=constants!$C$60,C283,E283))","v":3.0513999999999992},{"$f":"IF($B$7=constants!$C$60,H283,IF($B$8=constants!$C$60,D283,F283))","v":3.0663999999999993},1,3.0513999999999992,2.6,2.6,{"$f":"IF(OR($B$22=constants!$B$60,AND(I283>$B$12,$B$12<>-1)),O282+(N283-O282)*$O$74,O282+(L283-O282)*$O$74)","v":2.6},2.58,2.6,2.6,2.6,2.6,2.6,2.6,2.6,2.6,2.5700000000000003,2.5649999999999999,2.56]
[1,2.0799999999999996,3.0805999999999987,3.0955999999999988,3.54196,3.5569600000000001,2.9804999999999997,2.9954999999999998,{"$f":"IF($B$7=constants!$C$60,G284,IF($B$8=constants!$C$60,C284,E284))","v":3.0805999999999987},{"$f":"IF($B$7=constants!$C$60,H284,IF($B$8=constants!$C$60,D284,F284))","v":3.0955999999999988},1,3.0805999999999987,2.6,2.6,{"$f":"IF(OR($B$22=constants!$B$60,AND(I284>$B$12,$B$12<>-1)),O283+(N284-O283)*$O$74,O283+(L284-O283)*$O$74)","v":2.6},2.58,2.6,2.6,2.6,2.6,2.6,2.6,2.6,2.6,2.5700000000000003,2.5649999999999999,2.56]
[1,2.0899999999999994,3.1097999999999981,3.1247999999999982,3.5375800000000002,3.5525800000000003,2.9794999999999998,2.9944999999999999,{"$f":"IF($B$7=constants!$C$60,G285,IF($B$8=constants!$C$60,C285,E285))","v":3.1097999999999981},{"$f":"IF($B$7=constants!$C$60,H285,IF($B$8=constants!$C$60,D285,F285))","v":3.1247999999999982},1,3.1097999999999981,2.6,2.6,{"$f":"IF(OR($B$22=constants!$B$60,AND(I285>$B$12,$B$12<>-1)),O284+(N285-O284)*$O$74,O284+(L285-O284)*$O$74)","v":2.6},2.58,2.6,2.6,2.6,2.6,2.6,2.6,2.6,2.6,2.5700000000000003,2.5649999999999999,2.56]
[1,2.0999999999999992,3.1389999999999976,3.1539999999999977,3.5332000000000003,3.5482000000000005,2.9784999999999999,2.9935,{"$f":"IF($B$7=constants!$C$60,G286,IF($B$8=constants!$C$60,C286,E286))","v":3.1389999999999976},{"$f":"IF($B$7=constants!$C$60,H286,IF($B$8=constants!$C$60,D286,F286))","v":3.1539999999999977},1,3.1389999999999976,2.6,2.6,{"$f":"IF(OR($B$22=constants!$B$60,AND(I286>$B$12,$B$12<>-1)),O285+(N286-O285)*$O$74,O285+(L286-O285)*$O$74)","v":2.6},2.58,2.6,2.6,2.6,2.6,2.6,2.6,2.6,2.6,2.5700000000000003,2.5649999999999999,2.56]
[1,2.109999999999999,3.1681999999999961,3.1831999999999963,3.5288200000000005,3.5438200000000006,2.9774999999999996,2.9924999999999997,{"$f":"IF($B$7=constants!$C$60,G287,IF($B$8=constants!$C$60,C287,E287))","v":3.1681999999999961},{"$f":"IF($B$7=constants!$C$60,H287,IF($B$8=constants!$C$60,D287,F287))","v":3.1831999999999963},1,3.1681999999999961,2.6,2.6,{"$f":"IF(OR($B$22=constants!$B$60,AND(I287>$B$12,$B$12<>-1)),O286+(N287-O286)*$O$74,O286+(L287-O286)*$O$74)","v":2.6},2.58,2.6,2.6,2.6,2.6,2.6,2.6,2.6,2.6,2.5700000000000003,2.5649999999999999,2.56]
[1,2.1199999999999988,3.1973999999999956,3.2123999999999957,3.5244400000000002,3.5394400000000004,2.9764999999999997,2.9914999999999998,{"$f":"IF($B$7=constants!$C$60,G288,IF($B$8=constants!$C$60,C288,E288))","v":3.1973999999999956},{"$f":"IF($B$7=constants!$C$60,H288,IF($B$8=constants!$C$60,D288,F288))","v":3.2123999999999957},1,3.1973999999999956,2.6,2.6,{"$f":"IF(OR($B$22=constants!$B$60,AND(I288>$B$12,$B$12<>-1)),O287+(N288-O287)*$O$74,O287+(L288-O287)*$O$74)","v":2.6},2.58,2.6,2.6,2.6,2.6,2.6,2.6,2.6,2.6,2.5700000000000003,2.5649999999999999,2.56]
[1,2.1299999999999986,3.226599999999995,3.2415999999999952,3.5200600000000004,3.5350600000000005,2.9754999999999998,2.9904999999999999,{"$f":"IF($B$7=constants!$C$60,G289,IF($B$8=constants!$C$60,C289,E289))","v":3.226599999999995},{"$f":"IF($B$7=constants!$C$60,H289,IF($B$8=constants!$C$60,D289,F289))","v":3.2415999999999952},1,3.226599999999995,2.6,2.6,{"$f":"IF(OR($B$22=constants!$B$60,AND(I289>$B$12,$B$12<>-1)),O288+(N289-O288)*$O$74,O288+(L289-O288)*$O$74)","v":2.6},2.58,2.6,2.6,2.6,2.6,2.6,2.6,2.6,2.6,2.5700000000000003,2.5649999999999999,2.56]
[1,2.1399999999999983,3.2557999999999945,3.2707999999999946,3.5156800000000006,3.5306800000000007,2.9744999999999999,2.9895,{"$f":"IF($B$7=constants!$C$60,G290,IF($B$8=constants!$C$60,C290,E290))","v":3.2557999999999945},{"$f":"IF($B$7=constants!$C$60,H290,IF($B$8=constants!$C$60,D290,F290))","v":3.2707999999999946},1,3.2557999999999945,2.6,2.6,{"$f":"IF(OR($B$22=constants!$B$60,AND(I290>$B$12,$B$12<>-1)),O289+(N290-O289)*$O$74,O289+(L290-O289)*$O$74)","v":2.6},2.58,2.6,2.6,2.6,2.6,2.6,2.6,2.6,2.6,2.5700000000000003,2.5649999999999999,2.56]
[1,2.1499999999999981,3.2849999999999939,3.299999999999994,3.5113000000000008,3.5263000000000009,2.9735,2.9885000000000002,{"$f":"IF($B$7=constants!$C$60,G291,IF($B$8=constants!$C$60,C291,E291))","v":3.2849999999999939},{"$f":"IF($B$7=constants!$C$60,H291,IF($B$8=constants!$C$60,D291,F291))","v":3.299999999999994},1,3.2849999999999939,2.6,2.6,{"$f":"IF(OR($B$22=constants!$B$60,AND(I291>$B$12,$B$12<>-1)),O290+(N291-O290)*$O$74,O290+(L291-O290)*$O$74)","v":2.6},2.58,2.6,2.6,2.6,2.6,2.6,2.6,2.6,2.6,2.5700000000000003,2.5649999999999999,2.56]
[1,2.1599999999999979,3.3141999999999934,3.3291999999999935,3.5069200000000009,3.521920000000001,2.9724999999999997,2.9874999999999998,{"$f":"IF($B$7=constants!$C$60,G292,IF($B$8=constants!$C$60,C292,E292))","v":3.3141999999999934},{"$f":"IF($B$7=constants!$C$60,H292,IF($B$8=constants!$C$60,D292,F292))","v":3.3291999999999935},1,3.3141999999999934,2.6,2.6,{"$f":"IF(OR($B$22=constants!$B$60,AND(I292>$B$12,$B$12<>-1)),O291+(N292-O291)*$O$74,O291+(L292-O291)*$O$74)","v":2.6},2.58,2.6,2.6,2.6,2.6,2.6,2.6,2.6,2.6,2.5700000000000003,2.5649999999999999,2.56]
[1,2.1699999999999977,3.3433999999999928,3.3583999999999929,3.5025400000000007,3.5175400000000008,2.9714999999999998,2.9864999999999999,{"$f":"IF($B$7=constants!$C$60,G293,IF($B$8=constants!$C$60,C293,E293))","v":3.3433999999999928},{"$f":"IF($B$7=constants!$C$60,H293,IF($B$8=constants!$C$60,D293,F293))","v":3.3583999999999929},1,3.3433999999999928,2.6,2.6,{"$f":"IF(OR($B$22=constants!$B$60,AND(I293>$B$12,$B$12<>-1)),O292+(N293-O292)*$O$74,O292+(L293-O292)*$O$74)","v":2.6},2.58,2.6,2.6,2.6,2.6,2.6,2.6,2.6,2.6,2.5700000000000003,2.5649999999999999,2.56]
[1,2.1799999999999975,3.3725999999999923,3.3875999999999924,3.4981600000000008,3.5131600000000009,2.9704999999999999,2.9855,{"$f":"IF($B$7=constants!$C$60,G294,IF($B$8=constants!$C$60,C294,E294))","v":3.3725999999999923},{"$f":"IF($B$7=constants!$C$60,H294,IF($B$8=constants!$C$60,D294,F294))","v":3.3875999999999924},1,3.3725999999999923,2.6,2.6,{"$f":"IF(OR($B$22=constants!$B$60,AND(I294>$B$12,$B$12<>-1)),O293+(N294-O293)*$O$74,O293+(L294-O293)*$O$74)","v":2.6},2.58,2.6,2.6,2.6,2.6,2.6,2.6,2.6,2.6,2.5700000000000003,2.5649999999999999,2.56]
[1,2.1899999999999973,3.4017999999999917,3.4167999999999918,3.493780000000001,3.5087800000000011,2.9695,2.9845000000000002,{"$f":"IF($B$7=constants!$C$60,G295,IF($B$8=constants!$C$60,C295,E295))","v":3.4017999999999917},{"$f":"IF($B$7=constants!$C$60,H295,IF($B$8=constants!$C$60,D295,F295))","v":3.4167999999999918},1,3.4017999999999917,2.6,2.6,{"$f":"IF(OR($B$22=constants!$B$60,AND(I295>$B$12,$B$12<>-1)),O294+(N295-O294)*$O$74,O294+(L295-O294)*$O$74)","v":2.6},2.58,2.6,2.6,2.6,2.6,2.6,2.6,2.6,2.6,2.5700000000000003,2.5649999999999999,2.56]
[1,2.1999999999999971,3.4309999999999912,3.4459999999999913,3.4894000000000012,3.5044000000000013,2.9685000000000001,2.9835000000000003,{"$f":"IF($B$7=constants!$C$60,G296,IF($B$8=constants!$C$60,C296,E296))","v":3.4309999999999912},{"$f":"IF($B$7=constants!$C$60,H296,IF($B$8=constants!$C$60,D296,F296))","v":3.4459999999999913},1,3.4309999999999912,2.6,2.6,{"$f":"IF(OR($B$22=constants!$B$60,AND(I296>$B$12,$B$12<>-1)),O295+(N296-O295)*$O$74,O295+(L296-O295)*$O$74)","v":2.6},2.58,2.6,2.6,2.6,2.6,2.6,2.6,2.6,2.6,2.5700000000000003,2.5649999999999999,2.56]
[1,2.2099999999999969,3.4601999999999906,3.4751999999999907,3.4850200000000013,3.5000200000000015,2.9674999999999998,2.9824999999999999,{"$f":"IF($B$7=constants!$C$60,G297,IF($B$8=constants!$C$60,C297,E297))","v":3.4601999999999906},{"$f":"IF($B$7=constants!$C$60,H297,IF($B$8=constants!$C$60,D297,F297))","v":3.4751999999999907},1,3.4601999999999906,2.6,2.6,{"$f":"IF(OR($B$22=constants!$B$60,AND(I297>$B$12,$B$12<>-1)),O296+(N297-O296)*$O$74,O296+(L297-O296)*$O$74)","v":2.6},2.58,2.6,2.6,2.6,2.6,2.6,2.6,2.6,2.6,2.5700000000000003,2.5649999999999999,2.56]
[1,2.2199999999999966,3.4893999999999901,3.5043999999999902,3.4806400000000011,3.4956400000000012,2.9664999999999999,2.9815,{"$f":"IF($B$7=constants!$C$60,G298,IF($B$8=constants!$C$60,C298,E298))","v":3.4893999999999901},{"$f":"IF($B$7=constants!$C$60,H298,IF($B$8=constants!$C$60,D298,F298))","v":3.5043999999999902},1,3.4893999999999901,2.6,2.6,{"$f":"IF(OR($B$22=constants!$B$60,AND(I298>$B$12,$B$12<>-1)),O297+(N298-O297)*$O$74,O297+(L298-O297)*$O$74)","v":2.6},2.58,2.6,2.6,2.6,2.6,2.6,2.6,2.6,2.6,2.5700000000000003,2.5649999999999999,2.56]
[1,2.2299999999999964,3.5185999999999895,3.5335999999999896,3.4762600000000012,3.4912600000000014,2.9655,2.9805000000000001,{"$f":"IF($B$7=constants!$C$60,G299,IF($B$8=constants!$C$60,C299,E299))","v":3.5185999999999895},{"$f":"IF($B$7=constants!$C$60,H299,IF($B$8=constants!$C$60,D299,F299))","v":3.5335999999999896},1,3.5185999999999895,2.6,2.6,{"$f":"IF(OR($B$22=constants!$B$60,AND(I299>$B$12,$B$12<>-1)),O298+(N299-O298)*$O$74,O298+(L299-O298)*$O$74)","v":2.6},2.58,2.6,2.6,2.6,2.6,2.6,2.6,2.6,2.6,2.5700000000000003,2.5649999999999999,2.56]
[1,2.2399999999999962,3.5477999999999881,3.5627999999999882,3.4718800000000014,3.4868800000000015,2.9645000000000001,2.9795000000000003,{"$f":"IF($B$7=constants!$C$60,G300,IF($B$8=constants!$C$60,C300,E300))","v":3.5477999999999881},{"$f":"IF($B$7=constants!$C$60,H300,IF($B$8=constants!$C$60,D300,F300))","v":3.5627999999999882},1,3.5477999999999881,2.6,2.6,{"$f":"IF(OR($B$22=constants!$B$60,AND(I300>$B$12,$B$12<>-1)),O299+(N300-O299)*$O$74,O299+(L300-O299)*$O$74)","v":2.6},2.58,2.6,2.6,2.6,2.6,2.6,2.6,2.6,2.6,2.5700000000000003,2.5649999999999999,2.56]
[1,2.249999999999996,{"$f":"$D$33*B301+$D$34","v":3.5770000000000035},3.5920000000000036,3.4675000000000016,3.4825000000000017,2.9635000000000002,2.9785000000000004,{"$f":"IF($B$7=constants!$C$60,G301,IF($B$8=constants!$C$60,C301,E301))","v":3.5770000000000035},{"$f":"IF($B$7=constants!$C$60,H301,IF($B$8=constants!$C$60,D301,F301))","v":3.5920000000000036},1,3.5770000000000035,2.6,2.6,{"$f":"IF(OR($B$22=constants!$B$60,AND(I301>$B$12,$B$12<>-1)),O300+(N301-O300)*$O$74,O300+(L301-O300)*$O$74)","v":2.6},2.58,2.6,2.6,{"$f":"S$72*IF(S$71=0,$L301,IF(S$71=1,$R301,IF($B$12=-1,$L301,IF($I301>$B$12,$R301,$L301))))","v":2.6},2.6,2.6,2.6,2.6,2.6,2.5700000000000003,2.5649999999999999,2.56]
[1,2.2599999999999958,{"$f":"$D$33*B302+$D$34","v":3.5682400000000039},3.583240000000004,3.4631200000000018,3.4781200000000019,2.9624999999999999,2.9775,{"$f":"IF($B$7=constants!$C$60,G302,IF($B$8=constants!$C$60,C302,E302))","v":3.5682400000000039},{"$f":"IF($B$7=constants!$C$60,H302,IF($B$8=constants!$C$60,D302,F302))","v":3.583240000000004},1,3.5682400000000039,2.6,2.6,{"$f":"IF(OR($B$22=constants!$B$60,AND(I302>$B$12,$B$12<>-1)),O301+(N302-O301)*$O$74,O301+(L302-O301)*$O$74)","v":2.6},2.58,2.6,2.6,2.6,2.6,2.6,2.6,2.6,2.6,2.5700000000000003,2.5649999999999999,2.56]
[1,2.2699999999999956,3.5594800000000038,3.5744800000000039,3.4587400000000015,3.4737400000000016,2.9615,2.9765000000000001,{"$f":"IF($B$7=constants!$C$60,G303,IF($B$8=constants!$C$60,C303,E303))","v":3.5594800000000038},{"$f":"IF($B$7=constants!$C$60,H303,IF($B$8=constants!$C$60,D303,F303))","v":3.5744800000000039},1,3.5594800000000038,2.6,2.6,{"$f":"IF(OR($B$22=constants!$B$60,AND(I303>$B$12,$B$12<>-1)),O302+(N303-O302)*$O$74,O302+(L303-O302)*$O$74)","v":2.6},2.58,2.6,2.6,2.6,2.6,2.6,2.6,2.6,2.6,2.5700000000000003,2.5649999999999999,2.56]
[1,2.2799999999999954,3.5507200000000037,3.5657200000000038,3.4543600000000017,3.4693600000000018,2.9605000000000001,2.9755000000000003,{"$f":"IF($B$7=constants!$C$60,G304,IF($B$8=constants!$C$60,C304,E304))","v":3.5507200000000037},{"$f":"IF($B$7=constants!$C$60,H304,IF($B$8=constants!$C$60,D304,F304))","v":3.5657200000000038},1,{"$f":"IF($K304=0,IF($I304>$B$16,L303+($I304-L303)*L$74-J$72,L303-L303/L$74),IF($I304>$B$17,L303+($I304-L303)*L$74-J$72,L303-L303/L$74))","v":3.5507200000000037},2.6,2.6,{"$f":"IF(OR($B$22=constants!$B$60,AND(I304>$B$12,$B$12<>-1)),O303+(N304-O303)*$O$74,O303+(L304-O303)*$O$74)","v":2.6},2.58,{"$f":"IF($K304=0,IF($I304>$B$16,R303+($B$21-R303)*R$74-R$72,R303-R303/R$74),IF($I304>$B$17,R303+($B$21-R303)*R$74-R$72,R303-R303/R$74))","v":2.6},2.6,2.6,2.6,2.6,2.6,2.6,2.6,2.5700000000000003,2.5649999999999999,2.56]
[1,2.2899999999999952,3.541960000000004,3.5569600000000041,3.4499800000000018,{"$f":"E305+$F$74","v":3.4649800000000019},2.9595000000000002,2.9745000000000004,{"$f":"IF($B$7=constants!$C$60,G305,IF($B$8=constants!$C$60,C305,E305))","v":3.541960000000004},{"$f":"IF($B$7=constants!$C$60,H305,IF($B$8=constants!$C$60,D305,F305))","v":3.5569600000000041},1,3.541960000000004,2.6,2.6,{"$f":"IF(OR($B$22=constants!$B$60,AND(I305>$B$12,$B$12<>-1)),O304+(N305-O304)*$O$74,O304+(L305-O304)*$O$74)","v":2.6},2.58,2.6,2.6,2.6,2.6,2.6,2.6,2.6,2.6,2.5700000000000003,2.5649999999999999,2.56]
[1,2.2999999999999949,3.5332000000000043,3.5482000000000045,3.445600000000002,3.4606000000000021,2.9585000000000004,2.9735000000000005,{"$f":"IF($B$7=constants!$C$60,G306,IF($B$8=constants!$C$60,C306,E306))","v":3.5332000000000043},{"$f":"IF($B$7=constants!$C$60,H306,IF($B$8=constants!$C$60,D306,F306))","v":3.5482000000000045},1,3.5332000000000043,{"$f":"IF($K306=0,IF($I306>$B$16,M305+($B$20-M305)*M$74-K$72,M305-M305/M$74),IF($I306>$B$17,M305+($B$20-M305)*M$74-K$72,M305-M305/M$74))","v":2.6},2.6,{"$f":"IF(OR($B$22=constants!$B$60,AND(I306>$B$12,$B$12<>-1)),O305+(N306-O305)*$O$74,O305+(L306-O305)*$O$74)","v":2.6},2.58,2.6,2.6,2.6,2.6,2.6,2.6,2.6,2.6,2.5700000000000003,2.5649999999999999,2.56]
[1,2.3099999999999947,3.5244400000000047,3.5394400000000048,3.4412200000000022,3.4562200000000023,2.9575,2.9725000000000001,{"$f":"IF($B$7=constants!$C$60,G307,IF($B$8=constants!$C$60,C307,E307))","v":3.5244400000000047},{"$f":"IF($B$7=constants!$C$60,H307,IF($B$8=constants!$C$60,D307,F307))","v":3.5394400000000048},1,3.5244400000000047,2.6,2.6,{"$f":"IF(OR($B$22=constants!$B$60,AND(I307>$B$12,$B$12<>-1)),O306+(N307-O306)*$O$74,O306+(L307-O306)*$O$74)","v":2.6},2.58,2.6,2.6,2.6,2.6,2.6,2.6,2.6,2.6,2.5700000000000003,2.5649999999999999,2.56]
[1,2.3199999999999945,3.5156800000000046,3.5306800000000047,3.4368400000000019,3.451840000000002,2.9565000000000001,{"$f":"$H$63*B308+$H$64","v":2.9715000000000003},{"$f":"IF($B$7=constants!$C$60,G308,IF($B$8=constants!$C$60,C308,E308))","v":3.5156800000000046},{"$f":"IF($B$7=constants!$C$60,H308,IF($B$8=constants!$C$60,D308,F308))","v":3.5306800000000047},1,3.5156800000000046,2.6,2.6,{"$f":"IF(OR($B$22=constants!$B$60,AND(I308>$B$12,$B$12<>-1)),O307+(N308-O307)*$O$74,O307+(L308-O307)*$O$74)","v":2.6},2.58,2.6,2.6,2.6,2.6,2.6,2.6,2.6,2.6,2.5700000000000003,2.5649999999999999,2.56]
[1,2.3299999999999943,3.5069200000000049,{"$f":"C309+$D$74","v":3.521920000000005},3.4324600000000025,3.4474600000000026,2.9555000000000002,2.9705000000000004,{"$f":"IF($B$7=constants!$C$60,G309,IF($B$8=constants!$C$60,C309,E309))","v":3.5069200000000049},{"$f":"IF($B$7=constants!$C$60,H309,IF($B$8=constants!$C$60,D309,F309))","v":3.521920000000005},1,3.5069200000000049,2.6,2.6,{"$f":"IF(OR($B$22=constants!$B$60,AND(I309>$B$12,$B$12<>-1)),O308+(N309-O308)*$O$74,O308+(L309-O308)*$O$74)","v":2.6},2.58,2.6,2.6,2.6,2.6,2.6,2.6,2.6,2.6,2.5700000000000003,2.5649999999999999,2.56]
[1,2.3399999999999941,3.4981600000000048,3.5131600000000049,3.4280800000000022,3.4430800000000024,2.9545000000000003,2.9695000000000005,{"$f":"IF($B$7=constants!$C$60,G310,IF($B$8=constants!$C$60,C310,E310))","v":3.4981600000000048},{"$f":"IF($B$7=constants!$C$60,H310,IF($B$8=constants!$C$60,D310,F310))","v":3.5131600000000049},1,3.4981600000000048,2.6,2.6,{"$f":"IF(OR($B$22=constants!$B$60,AND(I310>$B$12,$B$12<>-1)),O309+(N310-O309)*$O$74,O309+(L310-O309)*$O$74)","v":2.6},2.58,2.6,2.6,2.6,2.6,2.6,2.6,2.6,2.6,2.5700000000000003,2.5649999999999999,2.56]
[1,2.3499999999999939,3.4894000000000052,3.5044000000000053,3.4237000000000024,3.4387000000000025,2.9535000000000005,2.9685000000000006,{"$f":"IF($B$7=constants!$C$60,G311,IF($B$8=constants!$C$60,C311,E311))","v":3.4894000000000052},{"$f":"IF($B$7=constants!$C$60,H311,IF($B$8=constants!$C$60,D311,F311))","v":3.5044000000000053},1,3.4894000000000052,2.6,2.6,{"$f":"IF(OR($B$22=constants!$B$60,AND(I311>$B$12,$B$12<>-1)),O310+(N311-O310)*$O$74,O310+(L311-O310)*$O$74)","v":2.6},2.58,2.6,2.6,2.6,2.6,2.6,2.6,2.6,2.6,2.5700000000000003,2.5649999999999999,2.56]
[1,2.3599999999999937,3.4806400000000055,3.4956400000000056,3.4193200000000026,3.4343200000000027,2.9525000000000001,2.9675000000000002,{"$f":"IF($B$7=constants!$C$60,G312,IF($B$8=constants!$C$60,C312,E312))","v":3.4806400000000055},{"$f":"IF($B$7=constants!$C$60,H312,IF($B$8=constants!$C$60,D312,F312))","v":3.4956400000000056},1,3.4806400000000055,2.6,2.6,{"$f":"IF(OR($B$22=constants!$B$60,AND(I312>$B$12,$B$12<>-1)),O311+(N312-O311)*$O$74,O311+(L312-O311)*$O$74)","v":2.6},2.58,2.6,2.6,2.6,2.6,2.6,2.6,2.6,2.6,2.5700000000000003,2.5649999999999999,2.56]
[1,2.3699999999999934,3.4718800000000054,3.4868800000000055,3.4149400000000023,3.4299400000000024,2.9515000000000002,2.9665000000000004,{"$f":"IF($B$7=constants!$C$60,G313,IF($B$8=constants!$C$60,C313,E313))","v":3.4718800000000054},{"$f":"IF($B$7=constants!$C$60,H313,IF($B$8=constants!$C$60,D313,F313))","v":3.4868800000000055},1,3.4718800000000054,2.6,2.6,{"$f":"IF(OR($B$22=constants!$B$60,AND(I313>$B$12,$B$12<>-1)),O312+(N313-O312)*$O$74,O312+(L313-O312)*$O$74)","v":2.6},2.58,2.6,2.6,2.6,2.6,2.6,2.6,2.6,2.6,2.5700000000000003,2.5649999999999999,2.56]
[1,2.3799999999999932,3.4631200000000057,3.4781200000000059,3.4105600000000029,3.425560000000003,2.9505000000000003,2.9655000000000005,{"$f":"IF($B$7=constants!$C$60,G314,IF($B$8=constants!$C$60,C314,E314))","v":3.4631200000000057},{"$f":"IF($B$7=constants!$C$60,H314,IF($B$8=constants!$C$60,D314,F314))","v":3.4781200000000059},1,3.4631200000000057,2.6,2.6,{"$f":"IF(OR($B$22=constants!$B$60,AND(I314>$B$12,$B$12<>-1)),O313+(N314-O313)*$O$74,O313+(L314-O313)*$O$74)","v":2.6},2.58,2.6,2.6,2.6,2.6,2.6,2.6,2.6,2.6,2.5700000000000003,2.5649999999999999,2.56]
[1,2.389999999999993,3.4543600000000061,3.4693600000000062,3.4061800000000027,3.4211800000000028,2.9495000000000005,2.9645000000000006,{"$f":"IF($B$7=constants!$C$60,G315,IF($B$8=constants!$C$60,C315,E315))","v":3.4543600000000061},{"$f":"IF($B$7=constants!$C$60,H315,IF($B$8=constants!$C$60,D315,F315))","v":3.4693600000000062},1,3.4543600000000061,2.6,2.6,{"$f":"IF(OR($B$22=constants!$B$60,AND(I315>$B$12,$B$12<>-1)),O314+(N315-O314)*$O$74,O314+(L315-O314)*$O$74)","v":2.6},2.58,2.6,2.6,2.6,2.6,2.6,2.6,2.6,2.6,2.5700000000000003,2.5649999999999999,2.56]
[1,2.3999999999999928,3.445600000000006,3.4606000000000061,3.4018000000000028,3.4168000000000029,2.9485000000000006,2.9635000000000007,{"$f":"IF($B$7=constants!$C$60,G316,IF($B$8=constants!$C$60,C316,E316))","v":3.445600000000006},{"$f":"IF($B$7=constants!$C$60,H316,IF($B$8=constants!$C$60,D316,F316))","v":3.4606000000000061},1,3.445600000000006,2.6,2.6,{"$f":"IF(OR($B$22=constants!$B$60,AND(I316>$B$12,$B$12<>-1)),O315+(N316-O315)*$O$74,O315+(L316-O315)*$O$74)","v":2.6},2.58,2.6,2.6,2.6,2.6,2.6,2.6,2.6,2.6,2.5700000000000003,2.5649999999999999,2.56]
[1,2.4099999999999926,3.4368400000000063,3.4518400000000065,3.397420000000003,3.4124200000000031,2.9475000000000002,2.9625000000000004,{"$f":"IF($B$7=constants!$C$60,G317,IF($B$8=constants!$C$60,C317,E317))","v":3.4368400000000063},{"$f":"IF($B$7=constants!$C$60,H317,IF($B$8=constants!$C$60,D317,F317))","v":3.4518400000000065},1,3.4368400000000063,2.6,2.6,{"$f":"IF(OR($B$22=constants!$B$60,AND(I317>$B$12,$B$12<>-1)),O316+(N317-O316)*$O$74,O316+(L317-O316)*$O$74)","v":2.6},2.58,2.6,2.6,2.6,2.6,2.6,2.6,2.6,2.6,2.5700000000000003,2.5649999999999999,2.56]
[1,2.4199999999999924,3.4280800000000062,3.4430800000000064,3.3930400000000027,3.4080400000000028,2.9465000000000003,2.9615000000000005,{"$f":"IF($B$7=constants!$C$60,G318,IF($B$8=constants!$C$60,C318,E318))","v":3.4280800000000062},{"$f":"IF($B$7=constants!$C$60,H318,IF($B$8=constants!$C$60,D318,F318))","v":3.4430800000000064},1,3.4280800000000062,2.6,2.6,{"$f":"IF(OR($B$22=constants!$B$60,AND(I318>$B$12,$B$12<>-1)),O317+(N318-O317)*$O$74,O317+(L318-O317)*$O$74)","v":2.6},2.58,2.6,2.6,2.6,2.6,2.6,2.6,2.6,2.6,2.5700000000000003,2.5649999999999999,2.56]
[1,2.4299999999999922,3.4193200000000066,3.4343200000000067,3.3886600000000033,3.4036600000000035,2.9455000000000005,2.9605000000000006,{"$f":"IF($B$7=constants!$C$60,G319,IF($B$8=constants!$C$60,C319,E319))","v":3.4193200000000066},{"$f":"IF($B$7=constants!$C$60,H319,IF($B$8=constants!$C$60,D319,F319))","v":3.4343200000000067},1,3.4193200000000066,2.6,2.6,{"$f":"IF(OR($B$22=constants!$B$60,AND(I319>$B$12,$B$12<>-1)),O318+(N319-O318)*$O$74,O318+(L319-O318)*$O$74)","v":2.6},2.58,2.6,2.6,2.6,2.6,2.6,2.6,2.6,2.6,2.5700000000000003,2.5649999999999999,2.56]
[1,2.439999999999992,3.4105600000000069,3.425560000000007,3.3842800000000031,3.3992800000000032,2.9445000000000006,2.9595000000000007,{"$f":"IF($B$7=constants!$C$60,G320,IF($B$8=constants!$C$60,C320,E320))","v":3.4105600000000069},{"$f":"IF($B$7=constants!$C$60,H320,IF($B$8=constants!$C$60,D320,F320))","v":3.425560000000007},1,3.4105600000000069,2.6,2.6,{"$f":"IF(OR($B$22=constants!$B$60,AND(I320>$B$12,$B$12<>-1)),O319+(N320-O319)*$O$74,O319+(L320-O319)*$O$74)","v":2.6},2.58,2.6,2.6,2.6,2.6,2.6,2.6,2.6,2.6,2.5700000000000003,2.5649999999999999,2.56]
[1,2.4499999999999917,3.4018000000000068,3.4168000000000069,3.3799000000000032,3.3949000000000034,2.9435000000000007,2.9585000000000008,{"$f":"IF($B$7=constants!$C$60,G321,IF($B$8=constants!$C$60,C321,E321))","v":3.4018000000000068},{"$f":"IF($B$7=constants!$C$60,H321,IF($B$8=constants!$C$60,D321,F321))","v":3.4168000000000069},1,3.4018000000000068,2.6,2.6,{"$f":"IF(OR($B$22=constants!$B$60,AND(I321>$B$12,$B$12<>-1)),O320+(N321-O320)*$O$74,O320+(L321-O320)*$O$74)","v":2.6},2.58,2.6,2.6,2.6,2.6,2.6,2.6,2.6,2.6,2.5700000000000003,2.5649999999999999,2.56]
[1,2.4599999999999915,3.3930400000000072,3.4080400000000073,3.3755200000000034,3.3905200000000035,2.9425000000000003,2.9575000000000005,{"$f":"IF($B$7=constants!$C$60,G322,IF($B$8=constants!$C$60,C322,E322))","v":3.3930400000000072},{"$f":"IF($B$7=constants!$C$60,H322,IF($B$8=constants!$C$60,D322,F322))","v":3.4080400000000073},1,3.3930400000000072,2.6,{"$f":"IF(M322>I322,L322,M322)","v":2.6},{"$f":"IF(OR($B$22=constants!$B$60,AND(I322>$B$12,$B$12<>-1)),O321+(N322-O321)*$O$74,O321+(L322-O321)*$O$74)","v":2.6},2.58,2.6,2.6,2.6,2.6,2.6,2.6,2.6,2.6,2.5700000000000003,2.5649999999999999,2.56]
[1,2.4699999999999913,3.3842800000000075,3.3992800000000076,3.3711400000000036,3.3861400000000037,2.9415000000000004,2.9565000000000006,{"$f":"IF($B$7=constants!$C$60,G323,IF($B$8=constants!$C$60,C323,E323))","v":3.3842800000000075},{"$f":"IF($B$7=constants!$C$60,H323,IF($B$8=constants!$C$60,D323,F323))","v":3.3992800000000076},1,3.3842800000000075,2.6,2.6,{"$f":"IF(OR($B$22=constants!$B$60,AND(I323>$B$12,$B$12<>-1)),O322+(N323-O322)*$O$74,O322+(L323-O322)*$O$74)","v":2.6},2.58,2.6,2.6,2.6,2.6,2.6,2.6,2.6,2.6,2.5700000000000003,2.5649999999999999,2.56]
[1,2.4799999999999911,3.3755200000000074,3.3905200000000075,3.3667600000000037,3.3817600000000039,2.9405000000000006,2.9555000000000007,{"$f":"IF($B$7=constants!$C$60,G324,IF($B$8=constants!$C$60,C324,E324))","v":3.3755200000000074},{"$f":"IF($B$7=constants!$C$60,H324,IF($B$8=constants!$C$60,D324,F324))","v":3.3905200000000075},1,3.3755200000000074,2.6,2.6,{"$f":"IF(OR($B$22=constants!$B$60,AND(I324>$B$12,$B$12<>-1)),O323+(N324-O323)*$O$74,O323+(L324-O323)*$O$74)","v":2.6},2.58,2.6,2.6,2.6,2.6,2.6,2.6,2.6,2.6,2.5700000000000003,2.5649999999999999,2.56]
[1,2.4899999999999909,3.3667600000000077,3.3817600000000079,3.3623800000000035,3.3773800000000036,2.9395000000000007,2.9545000000000008,{"$f":"IF($B$7=constants!$C$60,G325,IF($B$8=constants!$C$60,C325,E325))","v":3.3667600000000077},{"$f":"IF($B$7=constants!$C$60,H325,IF($B$8=constants!$C$60,D325,F325))","v":3.3817600000000079},1,3.3667600000000077,2.6,2.6,{"$f":"IF(OR($B$22=constants!$B$60,AND(I325>$B$12,$B$12<>-1)),O324+(N325-O324)*$O$74,O324+(L325-O324)*$O$74)","v":2.6},2.58,2.6,2.6,2.6,2.6,2.6,2.6,2.6,2.6,2.5700000000000003,2.5649999999999999,2.56]
[1,2.4999999999999907,{"$f":"$D$41*B326+$D$42","v":3.3579999999999917},3.3729999999999918,{"$f":"$K$19*$B326+$K$20","v":3.3579999999999957},3.3729999999999958,2.9385000000000008,2.9535000000000009,{"$f":"IF($B$7=constants!$C$60,G326,IF($B$8=constants!$C$60,C326,E326))","v":3.3579999999999917},{"$f":"IF($B$7=constants!$C$60,H326,IF($B$8=constants!$C$60,D326,F326))","v":3.3729999999999918},1,3.3579999999999917,2.6,2.6,{"$f":"IF(OR($B$22=constants!$B$60,AND(I326>$B$12,$B$12<>-1)),O325+(N326-O325)*$O$74,O325+(L326-O325)*$O$74)","v":2.6},2.58,2.6,2.6,2.6,2.6,2.6,2.6,2.6,2.6,2.5700000000000003,2.5649999999999999,2.56]
[1,2.5099999999999905,{"$f":"$D$41*B327+$D$42","v":3.3667599999999913},3.3817599999999914,{"$f":"$K$19*$B327+$K$20","v":3.3623799999999955},3.3773799999999956,2.9375000000000004,2.9525000000000006,{"$f":"IF($B$7=constants!$C$60,G327,IF($B$8=constants!$C$60,C327,E327))","v":3.3667599999999913},{"$f":"IF($B$7=constants!$C$60,H327,IF($B$8=constants!$C$60,D327,F327))","v":3.3817599999999914},1,3.3667599999999913,2.6,2.6,{"$f":"IF(OR($B$22=constants!$B$60,AND(I327>$B$12,$B$12<>-1)),O326+(N327-O326)*$O$74,O326+(L327-O326)*$O$74)","v":2.6},2.58,2.6,2.6,2.6,2.6,2.6,2.6,2.6,2.6,2.5700000000000003,2.5649999999999999,2.56]
[1,2.5199999999999902,3.375519999999991,3.3905199999999911,3.3667599999999953,3.3817599999999954,2.9365000000000006,2.9515000000000007,{"$f":"IF($B$7=constants!$C$60,G328,IF($B$8=constants!$C$60,C328,E328))","v":3.375519999999991},{"$f":"IF($B$7=constants!$C$60,H328,IF($B$8=constants!$C$60,D328,F328))","v":3.3905199999999911},1,3.375519999999991,2.6,2.6,{"$f":"IF(OR($B$22=constants!$B$60,AND(I328>$B$12,$B$12<>-1)),O327+(N328-O327)*$O$74,O327+(L328-O327)*$O$74)","v":2.6},2.58,2.6,2.6,2.6,2.6,2.6,2.6,2.6,2.6,2.5700000000000003,2.5649999999999999,2.56]
[1,2.52999999999999,3.3842799999999911,3.3992799999999912,3.3711399999999951,3.3861399999999953,2.9355000000000007,2.9505000000000008,{"$f":"IF($B$7=constants!$C$60,G329,IF($B$8=constants!$C$60,C329,E329))","v":3.3842799999999911},{"$f":"IF($B$7=constants!$C$60,H329,IF($B$8=constants!$C$60,D329,F329))","v":3.3992799999999912},1,3.3842799999999911,2.6,2.6,{"$f":"IF(OR($B$22=constants!$B$60,AND(I329>$B$12,$B$12<>-1)),O328+(N329-O328)*$O$74,O328+(L329-O328)*$O$74)","v":2.6},2.58,2.6,2.6,2.6,2.6,2.6,2.6,2.6,2.6,2.5700000000000003,2.5649999999999999,2.56]
[1,2.5399999999999898,3.3930399999999907,3.4080399999999909,3.3755199999999954,3.3905199999999955,2.9345000000000008,2.9495000000000009,{"$f":"IF($B$7=constants!$C$60,G330,IF($B$8=constants!$C$60,C330,E330))","v":3.3930399999999907},{"$f":"IF($B$7=constants!$C$60,H330,IF($B$8=constants!$C$60,D330,F330))","v":3.4080399999999909},1,3.3930399999999907,2.6,2.6,{"$f":"IF(OR($B$22=constants!$B$60,AND(I330>$B$12,$B$12<>-1)),O329+(N330-O329)*$O$74,O329+(L330-O329)*$O$74)","v":2.6},2.58,2.6,2.6,2.6,2.6,2.6,2.6,2.6,2.6,2.5700000000000003,2.5649999999999999,2.56]
[1,2.5499999999999896,3.4017999999999908,3.416799999999991,3.3798999999999952,3.3948999999999954,2.9335000000000009,2.948500000000001,{"$f":"IF($B$7=constants!$C$60,G331,IF($B$8=constants!$C$60,C331,E331))","v":3.4017999999999908},{"$f":"IF($B$7=constants!$C$60,H331,IF($B$8=constants!$C$60,D331,F331))","v":3.416799999999991},1,3.4017999999999908,2.6,2.6,{"$f":"IF(OR($B$22=constants!$B$60,AND(I331>$B$12,$B$12<>-1)),O330+(N331-O330)*$O$74,O330+(L331-O330)*$O$74)","v":2.6},2.58,2.6,2.6,2.6,2.6,2.6,2.6,2.6,2.6,2.5700000000000003,2.5649999999999999,2.56]
[1,2.5599999999999894,3.4105599999999905,3.4255599999999906,3.3842799999999951,3.3992799999999952,2.9325000000000006,2.9475000000000007,{"$f":"IF($B$7=constants!$C$60,G332,IF($B$8=constants!$C$60,C332,E332))","v":3.4105599999999905},{"$f":"IF($B$7=constants!$C$60,H332,IF($B$8=constants!$C$60,D332,F332))","v":3.4255599999999906},1,3.4105599999999905,2.6,2.6,{"$f":"IF(OR($B$22=constants!$B$60,AND(I332>$B$12,$B$12<>-1)),O331+(N332-O331)*$O$74,O331+(L332-O331)*$O$74)","v":2.6},2.58,2.6,2.6,2.6,2.6,2.6,2.6,2.6,2.6,2.5700000000000003,2.5649999999999999,2.56]
[{"$f":"IF(B333<=100,1,IF(B333<=200,2,3))","v":1},2.5699999999999892,3.4193199999999901,3.4343199999999903,3.3886599999999949,3.403659999999995,2.9315000000000007,2.9465000000000008,{"$f":"IF($B$7=constants!$C$60,G333,IF($B$8=constants!$C$60,C333,E333))","v":3.4193199999999901},{"$f":"IF($B$7=constants!$C$60,H333,IF($B$8=constants!$C$60,D333,F333))","v":3.4343199999999903},1,3.4193199999999901,2.6,2.6,{"$f":"IF(OR($B$22=constants!$B$60,AND(I333>$B$12,$B$12<>-1)),O332+(N333-O332)*$O$74,O332+(L333-O332)*$O$74)","v":2.6},{"$f":"IF(O333=0,0,O333-$P$72)","v":2.58},2.6,2.6,{"$f":"S$72*IF(S$71=0,$L333,IF(S$71=1,$R333,IF($B$12=-1,$L333,IF($I333>$B$12,$R333,$L333))))","v":2.6},2.6,2.6,2.6,2.6,2.6,{"$f":"IF(V333=0,0,V333-Y$72)","v":2.5700000000000003},{"$f":"IF(W333=0,0,W333-Z$72)","v":2.5649999999999999},{"$f":"IF(X333=0,0,X333-AA$72)","v":2.56}]
[1,{"$f":"B333+0.01","v":2.579999999999989},3.4280799999999902,3.4430799999999904,3.3930399999999947,3.4080399999999949,2.9305000000000008,2.9455000000000009,{"$f":"IF($B$7=constants!$C$60,G334,IF($B$8=constants!$C$60,C334,E334))","v":3.4280799999999902},{"$f":"IF($B$7=constants!$C$60,H334,IF($B$8=constants!$C$60,D334,F334))","v":3.4430799999999904},{"$f":"IF(AND(I334>$B$16,K333=0),1,IF(AND(I334<$B$17,K333=1),0,K333))","v":1},3.4280799999999902,2.6,2.6,{"$f":"IF(OR($B$22=constants!$B$60,AND(I334>$B$12,$B$12<>-1)),O333+(N334-O333)*$O$74,O333+(L334-O333)*$O$74)","v":2.6},2.58,2.6,{"$f":"IF(Q334>I334,I334,Q334)","v":2.6},2.6,2.6,2.6,{"$f":"V333+(S334-V$72-V333)*V$74","v":2.6},{"$f":"W333+(T334-W$72-W333)*W$74","v":2.6},{"$f":"X333+(U334-X$72-X333)*X$74","v":2.6},2.5700000000000003,2.5649999999999999,2.56]
[1,2.5899999999999888,3.4368399999999899,3.45183999999999,3.397419999999995,3.4124199999999951,2.9295000000000009,2.944500000000001,{"$f":"IF($B$7=constants!$C$60,G335,IF($B$8=constants!$C$60,C335,E335))","v":3.4368399999999899},{"$f":"IF($B$7=constants!$C$60,H335,IF($B$8=constants!$C$60,D335,F335))","v":3.45183999999999},1,3.4368399999999899,2.6,2.6,{"$f":"IF(OR($B$22=constants!$B$60,AND(I335>$B$12,$B$12<>-1)),O334+(N335-O334)*$O$74,O334+(L335-O334)*$O$74)","v":2.6},2.58,2.6,2.6,2.6,2.6,2.6,2.6,2.6,2.6,2.5700000000000003,2.5649999999999999,2.56]
[1,2.5999999999999885,3.4455999999999896,3.4605999999999897,3.4017999999999944,3.4167999999999945,2.928500000000001,2.9435000000000011,{"$f":"IF($B$7=constants!$C$60,G336,IF($B$8=constants!$C$60,C336,E336))","v":3.4455999999999896},{"$f":"IF($B$7=constants!$C$60,H336,IF($B$8=constants!$C$60,D336,F336))","v":3.4605999999999897},1,3.4455999999999896,2.6,2.6,{"$f":"IF(OR($B$22=constants!$B$60,AND(I336>$B$12,$B$12<>-1)),O335+(N336-O335)*$O$74,O335+(L336-O335)*$O$74)","v":2.6},2.58,2.6,2.6,2.6,2.6,2.6,2.6,2.6,2.6,2.5700000000000003,2.5649999999999999,2.56]
[1,2.6099999999999883,3.4543599999999897,3.4693599999999898,3.4061799999999947,{"$f":"E337+$F$74","v":3.4211799999999948},2.9275000000000007,2.9425000000000008,{"$f":"IF($B$7=constants!$C$60,G337,IF($B$8=constants!$C$60,C337,E337))","v":3.4543599999999897},{"$f":"IF($B$7=constants!$C$60,H337,IF($B$8=constants!$C$60,D337,F337))","v":3.4693599999999898},1,3.4543599999999897,2.6,2.6,{"$f":"IF(OR($B$22=constants!$B$60,AND(I337>$B$12,$B$12<>-1)),O336+(N337-O336)*$O$74,O336+(L337-O336)*$O$74)","v":2.6},2.58,2.6,2.6,2.6,2.6,2.6,2.6,2.6,2.6,2.5700000000000003,2.5649999999999999,2.56]
[1,2.6199999999999881,3.4631199999999893,3.4781199999999894,3.4105599999999945,3.4255599999999946,2.9265000000000008,2.9415000000000009,{"$f":"IF($B$7=constants!$C$60,G338,IF($B$8=constants!$C$60,C338,E338))","v":3.4631199999999893},{"$f":"IF($B$7=constants!$C$60,H338,IF($B$8=constants!$C$60,D338,F338))","v":3.4781199999999894},1,3.4631199999999893,2.6,2.6,{"$f":"IF(OR($B$22=constants!$B$60,AND(I338>$B$12,$B$12<>-1)),O337+(N338-O337)*$O$74,O337+(L338-O337)*$O$74)","v":2.6},2.58,2.6,2.6,2.6,2.6,2.6,2.6,2.6,2.6,2.5700000000000003,2.5649999999999999,2.56]
[1,2.6299999999999879,3.4718799999999894,3.4868799999999895,3.4149399999999943,3.4299399999999944,2.9255000000000009,2.940500000000001,{"$f":"IF($B$7=constants!$C$60,G339,IF($B$8=constants!$C$60,C339,E339))","v":3.4718799999999894},{"$f":"IF($B$7=constants!$C$60,H339,IF($B$8=constants!$C$60,D339,F339))","v":3.4868799999999895},1,3.4718799999999894,2.6,2.6,{"$f":"IF(OR($B$22=constants!$B$60,AND(I339>$B$12,$B$12<>-1)),O338+(N339-O338)*$O$74,O338+(L339-O338)*$O$74)","v":2.6},2.58,2.6,2.6,2.6,2.6,2.6,2.6,2.6,2.6,2.5700000000000003,2.5649999999999999,2.56]
[1,2.6399999999999877,3.4806399999999891,3.4956399999999892,3.4193199999999946,3.4343199999999947,2.924500000000001,{"$f":"$H$63*B340+$H$64","v":2.9395000000000011},{"$f":"IF($B$7=constants!$C$60,G340,IF($B$8=constants!$C$60,C340,E340))","v":3.4806399999999891},{"$f":"IF($B$7=constants!$C$60,H340,IF($B$8=constants!$C$60,D340,F340))","v":3.4956399999999892},1,3.4806399999999891,2.6,2.6,{"$f":"IF(OR($B$22=constants!$B$60,AND(I340>$B$12,$B$12<>-1)),O339+(N340-O339)*$O$74,O339+(L340-O339)*$O$74)","v":2.6},2.58,2.6,2.6,2.6,2.6,2.6,2.6,2.6,2.6,2.5700000000000003,2.5649999999999999,2.56]
[1,2.6499999999999875,3.4893999999999887,{"$f":"C341+$D$74","v":3.5043999999999889},3.423699999999994,3.4386999999999941,2.9235000000000011,2.9385000000000012,{"$f":"IF($B$7=constants!$C$60,G341,IF($B$8=constants!$C$60,C341,E341))","v":3.4893999999999887},{"$f":"IF($B$7=constants!$C$60,H341,IF($B$8=constants!$C$60,D341,F341))","v":3.5043999999999889},1,3.4893999999999887,2.6,2.6,{"$f":"IF(OR($B$22=constants!$B$60,AND(I341>$B$12,$B$12<>-1)),O340+(N341-O340)*$O$74,O340+(L341-O340)*$O$74)","v":2.6},2.58,2.6,2.6,2.6,2.6,2.6,2.6,2.6,2.6,2.5700000000000003,2.5649999999999999,2.56]
[1,2.6599999999999873,3.4981599999999888,3.513159999999989,3.4280799999999942,3.4430799999999944,{"$f":"(H342-$H$74)/(1-EXP(-1/G$74))*(1-EXP(-$B342/G$74))","v":2.9225000000000008},2.9375000000000009,{"$f":"IF($B$7=constants!$C$60,G342,IF($B$8=constants!$C$60,C342,E342))","v":3.4981599999999888},{"$f":"IF($B$7=constants!$C$60,H342,IF($B$8=constants!$C$60,D342,F342))","v":3.513159999999989},1,3.4981599999999888,2.6,2.6,{"$f":"IF(OR($B$22=constants!$B$60,AND(I342>$B$12,$B$12<>-1)),O341+(N342-O341)*$O$74,O341+(L342-O341)*$O$74)","v":2.6},2.58,2.6,2.6,2.6,2.6,2.6,2.6,2.6,2.6,2.5700000000000003,2.5649999999999999,2.56]
[1,2.6699999999999871,3.5069199999999885,3.5219199999999886,3.4324599999999941,3.4474599999999942,2.9215000000000009,2.936500000000001,{"$f":"IF($B$7=constants!$C$60,G343,IF($B$8=constants!$C$60,C343,E343))","v":3.5069199999999885},{"$f":"IF($B$7=constants!$C$60,H343,IF($B$8=constants!$C$60,D343,F343))","v":3.5219199999999886},1,3.5069199999999885,2.6,2.6,{"$f":"IF(OR($B$22=constants!$B$60,AND(I343>$B$12,$B$12<>-1)),O342+(N343-O342)*$O$74,O342+(L343-O342)*$O$74)","v":2.6},2.58,2.6,2.6,2.6,2.6,2.6,2.6,2.6,2.6,2.5700000000000003,2.5649999999999999,2.56]
[1,2.6799999999999868,3.5156799999999881,3.5306799999999883,3.4368399999999939,3.451839999999994,2.920500000000001,2.9355000000000011,{"$f":"IF($B$7=constants!$C$60,G344,IF($B$8=constants!$C$60,C344,E344))","v":3.5156799999999881},{"$f":"IF($B$7=constants!$C$60,H344,IF($B$8=constants!$C$60,D344,F344))","v":3.5306799999999883},1,3.5156799999999881,2.6,2.6,{"$f":"IF(OR($B$22=constants!$B$60,AND(I344>$B$12,$B$12<>-1)),O343+(N344-O343)*$O$74,O343+(L344-O343)*$O$74)","v":2.6},2.58,2.6,2.6,2.6,2.6,2.6,2.6,2.6,2.6,2.5700000000000003,2.5649999999999999,2.56]
[1,2.6899999999999866,3.5244399999999882,3.5394399999999884,3.4412199999999942,3.4562199999999943,2.9195000000000011,2.9345000000000012,{"$f":"IF($B$7=constants!$C$60,G345,IF($B$8=constants!$C$60,C345,E345))","v":3.5244399999999882},{"$f":"IF($B$7=constants!$C$60,H345,IF($B$8=constants!$C$60,D345,F345))","v":3.5394399999999884},1,3.5244399999999882,2.6,2.6,{"$f":"IF(OR($B$22=constants!$B$60,AND(I345>$B$12,$B$12<>-1)),O344+(N345-O344)*$O$74,O344+(L345-O344)*$O$74)","v":2.6},2.58,2.6,2.6,2.6,2.6,2.6,2.6,2.6,2.6,2.5700000000000003,2.5649999999999999,2.56]
[1,2.6999999999999864,3.5331999999999879,3.548199999999988,3.4455999999999936,3.4605999999999937,2.9185000000000012,2.9335000000000013,{"$f":"IF($B$7=constants!$C$60,G346,IF($B$8=constants!$C$60,C346,E346))","v":3.5331999999999879},{"$f":"IF($B$7=constants!$C$60,H346,IF($B$8=constants!$C$60,D346,F346))","v":3.548199999999988},1,3.5331999999999879,2.6,2.6,{"$f":"IF(OR($B$22=constants!$B$60,AND(I346>$B$12,$B$12<>-1)),O345+(N346-O345)*$O$74,O345+(L346-O345)*$O$74)","v":2.6},2.58,2.6,2.6,2.6,2.6,2.6,2.6,2.6,2.6,2.5700000000000003,2.5649999999999999,2.56]
[1,2.7099999999999862,3.541959999999988,3.5569599999999881,3.4499799999999938,3.464979999999994,2.9175000000000009,2.932500000000001,{"$f":"IF($B$7=constants!$C$60,G347,IF($B$8=constants!$C$60,C347,E347))","v":3.541959999999988},{"$f":"IF($B$7=constants!$C$60,H347,IF($B$8=constants!$C$60,D347,F347))","v":3.5569599999999881},1,3.541959999999988,2.6,2.6,{"$f":"IF(OR($B$22=constants!$B$60,AND(I347>$B$12,$B$12<>-1)),O346+(N347-O346)*$O$74,O346+(L347-O346)*$O$74)","v":2.6},2.58,2.6,2.6,2.6,2.6,2.6,2.6,2.6,2.6,2.5700000000000003,2.5649999999999999,2.56]
[1,2.719999999999986,3.5507199999999877,3.5657199999999878,3.4543599999999937,3.4693599999999938,2.916500000000001,2.9315000000000011,{"$f":"IF($B$7=constants!$C$60,G348,IF($B$8=constants!$C$60,C348,E348))","v":3.5507199999999877},{"$f":"IF($B$7=constants!$C$60,H348,IF($B$8=constants!$C$60,D348,F348))","v":3.5657199999999878},1,3.5507199999999877,2.6,2.6,{"$f":"IF(OR($B$22=constants!$B$60,AND(I348>$B$12,$B$12<>-1)),O347+(N348-O347)*$O$74,O347+(L348-O347)*$O$74)","v":2.6},2.58,2.6,2.6,2.6,2.6,2.6,2.6,2.6,2.6,2.5700000000000003,2.5649999999999999,2.56]
[1,2.7299999999999858,3.5594799999999873,3.5744799999999874,3.4587399999999935,3.4737399999999936,2.9155000000000011,2.9305000000000012,{"$f":"IF($B$7=constants!$C$60,G349,IF($B$8=constants!$C$60,C349,E349))","v":3.5594799999999873},{"$f":"IF($B$7=constants!$C$60,H349,IF($B$8=constants!$C$60,D349,F349))","v":3.5744799999999874},1,3.5594799999999873,2.6,2.6,{"$f":"IF(OR($B$22=constants!$B$60,AND(I349>$B$12,$B$12<>-1)),O348+(N349-O348)*$O$74,O348+(L349-O348)*$O$74)","v":2.6},2.58,2.6,2.6,2.6,2.6,2.6,2.6,2.6,2.6,2.5700000000000003,2.5649999999999999,2.56]
[1,2.7399999999999856,3.5682399999999874,3.5832399999999875,3.4631199999999938,3.4781199999999939,2.9145000000000012,2.9295000000000013,{"$f":"IF($B$7=constants!$C$60,G350,IF($B$8=constants!$C$60,C350,E350))","v":3.5682399999999874},{"$f":"IF($B$7=constants!$C$60,H350,IF($B$8=constants!$C$60,D350,F350))","v":3.5832399999999875},1,3.5682399999999874,2.6,2.6,{"$f":"IF(OR($B$22=constants!$B$60,AND(I350>$B$12,$B$12<>-1)),O349+(N350-O349)*$O$74,O349+(L350-O349)*$O$74)","v":2.6},2.58,2.6,2.6,2.6,2.6,2.6,2.6,2.6,2.6,2.5700000000000003,2.5649999999999999,2.56]
[1,2.7499999999999853,{"$f":"$D$45*B351+$D$46","v":3.5770000000000128},3.592000000000013,3.4674999999999931,3.4824999999999933,2.9135000000000013,2.9285000000000014,{"$f":"IF($B$7=constants!$C$60,G351,IF($B$8=constants!$C$60,C351,E351))","v":3.5770000000000128},{"$f":"IF($B$7=constants!$C$60,H351,IF($B$8=constants!$C$60,D351,F351))","v":3.592000000000013},1,3.5770000000000128,2.6,2.6,{"$f":"IF(OR($B$22=constants!$B$60,AND(I351>$B$12,$B$12<>-1)),O350+(N351-O350)*$O$74,O350+(L351-O350)*$O$74)","v":2.6},2.58,2.6,2.6,2.6,2.6,2.6,2.6,2.6,2.6,2.5700000000000003,2.5649999999999999,2.56]
[1,2.7599999999999851,{"$f":"$D$45*B352+$D$46","v":3.5682400000000132},3.5832400000000133,3.4718799999999934,3.4868799999999935,2.912500000000001,2.9275000000000011,{"$f":"IF($B$7=constants!$C$60,G352,IF($B$8=constants!$C$60,C352,E352))","v":3.5682400000000132},{"$f":"IF($B$7=constants!$C$60,H352,IF($B$8=constants!$C$60,D352,F352))","v":3.5832400000000133},1,3.5682400000000132,2.6,2.6,{"$f":"IF(OR($B$22=constants!$B$60,AND(I352>$B$12,$B$12<>-1)),O351+(N352-O351)*$O$74,O351+(L352-O351)*$O$74)","v":2.6},2.58,2.6,2.6,2.6,2.6,2.6,2.6,2.6,2.6,2.5700000000000003,2.5649999999999999,2.56]
[1,2.7699999999999849,3.5594800000000131,3.5744800000000132,3.4762599999999932,3.4912599999999934,2.9115000000000011,2.9265000000000012,{"$f":"IF($B$7=constants!$C$60,G353,IF($B$8=constants!$C$60,C353,E353))","v":3.5594800000000131},{"$f":"IF($B$7=constants!$C$60,H353,IF($B$8=constants!$C$60,D353,F353))","v":3.5744800000000132},1,3.5594800000000131,2.6,2.6,{"$f":"IF(OR($B$22=constants!$B$60,AND(I353>$B$12,$B$12<>-1)),O352+(N353-O352)*$O$74,O352+(L353-O352)*$O$74)","v":2.6},2.58,2.6,2.6,2.6,2.6,2.6,2.6,2.6,2.6,2.5700000000000003,2.5649999999999999,2.56]
[1,2.7799999999999847,3.5507200000000134,3.5657200000000135,3.4806399999999931,3.4956399999999932,2.9105000000000012,2.9255000000000013,{"$f":"IF($B$7=constants!$C$60,G354,IF($B$8=constants!$C$60,C354,E354))","v":3.5507200000000134},{"$f":"IF($B$7=constants!$C$60,H354,IF($B$8=constants!$C$60,D354,F354))","v":3.5657200000000135},1,3.5507200000000134,2.6,2.6,{"$f":"IF(OR($B$22=constants!$B$60,AND(I354>$B$12,$B$12<>-1)),O353+(N354-O353)*$O$74,O353+(L354-O353)*$O$74)","v":2.6},2.58,2.6,2.6,2.6,2.6,2.6,2.6,2.6,2.6,2.5700000000000003,2.5649999999999999,2.56]
[1,2.7899999999999845,3.5419600000000133,3.5569600000000134,3.4850199999999933,3.5000199999999935,2.9095000000000013,2.9245000000000014,{"$f":"IF($B$7=constants!$C$60,G355,IF($B$8=constants!$C$60,C355,E355))","v":3.5419600000000133},{"$f":"IF($B$7=constants!$C$60,H355,IF($B$8=constants!$C$60,D355,F355))","v":3.5569600000000134},1,3.5419600000000133,2.6,2.6,{"$f":"IF(OR($B$22=constants!$B$60,AND(I355>$B$12,$B$12<>-1)),O354+(N355-O354)*$O$74,O354+(L355-O354)*$O$74)","v":2.6},2.58,2.6,2.6,2.6,2.6,2.6,2.6,2.6,2.6,2.5700000000000003,2.5649999999999999,2.56]
[1,2.7999999999999843,3.5332000000000137,3.5482000000000138,3.4893999999999927,3.5043999999999929,2.9085000000000014,2.9235000000000015,{"$f":"IF($B$7=constants!$C$60,G356,IF($B$8=constants!$C$60,C356,E356))","v":3.5332000000000137},{"$f":"IF($B$7=constants!$C$60,H356,IF($B$8=constants!$C$60,D356,F356))","v":3.5482000000000138},1,3.5332000000000137,2.6,2.6,{"$f":"IF(OR($B$22=constants!$B$60,AND(I356>$B$12,$B$12<>-1)),O355+(N356-O355)*$O$74,O355+(L356-O355)*$O$74)","v":2.6},2.58,2.6,2.6,2.6,2.6,2.6,2.6,2.6,2.6,2.5700000000000003,2.5649999999999999,2.56]
[1,2.8099999999999841,3.524440000000014,3.5394400000000141,3.493779999999993,3.5087799999999931,2.9075000000000011,2.9225000000000012,{"$f":"IF($B$7=constants!$C$60,G357,IF($B$8=constants!$C$60,C357,E357))","v":3.524440000000014},{"$f":"IF($B$7=constants!$C$60,H357,IF($B$8=constants!$C$60,D357,F357))","v":3.5394400000000141},1,3.524440000000014,2.6,2.6,{"$f":"IF(OR($B$22=constants!$B$60,AND(I357>$B$12,$B$12<>-1)),O356+(N357-O356)*$O$74,O356+(L357-O356)*$O$74)","v":2.6},2.58,2.6,2.6,2.6,2.6,2.6,2.6,2.6,2.6,2.5700000000000003,2.5649999999999999,2.56]
[1,2.8199999999999839,3.5156800000000139,3.530680000000014,3.4981599999999928,3.513159999999993,2.9065000000000012,2.9215000000000013,{"$f":"IF($B$7=constants!$C$60,G358,IF($B$8=constants!$C$60,C358,E358))","v":3.5156800000000139},{"$f":"IF($B$7=constants!$C$60,H358,IF($B$8=constants!$C$60,D358,F358))","v":3.530680000000014},1,3.5156800000000139,2.6,2.6,{"$f":"IF(OR($B$22=constants!$B$60,AND(I358>$B$12,$B$12<>-1)),O357+(N358-O357)*$O$74,O357+(L358-O357)*$O$74)","v":2.6},2.58,2.6,2.6,2.6,2.6,2.6,2.6,2.6,2.6,2.5700000000000003,2.5649999999999999,2.56]
[1,2.8299999999999836,3.5069200000000142,3.5219200000000144,3.5025399999999927,3.5175399999999928,2.9055000000000013,2.9205000000000014,{"$f":"IF($B$7=constants!$C$60,G359,IF($B$8=constants!$C$60,C359,E359))","v":3.5069200000000142},{"$f":"IF($B$7=constants!$C$60,H359,IF($B$8=constants!$C$60,D359,F359))","v":3.5219200000000144},1,3.5069200000000142,2.6,2.6,{"$f":"IF(OR($B$22=constants!$B$60,AND(I359>$B$12,$B$12<>-1)),O358+(N359-O358)*$O$74,O358+(L359-O358)*$O$74)","v":2.6},2.58,2.6,2.6,2.6,2.6,2.6,2.6,2.6,2.6,2.5700000000000003,2.5649999999999999,2.56]
[1,2.8399999999999834,3.4981600000000141,3.5131600000000143,3.5069199999999929,3.5219199999999931,2.9045000000000014,2.9195000000000015,{"$f":"IF($B$7=constants!$C$60,G360,IF($B$8=constants!$C$60,C360,E360))","v":3.4981600000000141},{"$f":"IF($B$7=constants!$C$60,H360,IF($B$8=constants!$C$60,D360,F360))","v":3.5131600000000143},1,3.4981600000000141,2.6,2.6,{"$f":"IF(OR($B$22=constants!$B$60,AND(I360>$B$12,$B$12<>-1)),O359+(N360-O359)*$O$74,O359+(L360-O359)*$O$74)","v":2.6},2.58,2.6,2.6,2.6,2.6,2.6,2.6,2.6,2.6,2.5700000000000003,2.5649999999999999,2.56]
[1,2.8499999999999832,3.4894000000000145,3.5044000000000146,3.5112999999999923,3.5262999999999924,2.9035000000000015,2.9185000000000016,{"$f":"IF($B$7=constants!$C$60,G361,IF($B$8=constants!$C$60,C361,E361))","v":3.4894000000000145},{"$f":"IF($B$7=constants!$C$60,H361,IF($B$8=constants!$C$60,D361,F361))","v":3.5044000000000146},1,3.4894000000000145,2.6,2.6,{"$f":"IF(OR($B$22=constants!$B$60,AND(I361>$B$12,$B$12<>-1)),O360+(N361-O360)*$O$74,O360+(L361-O360)*$O$74)","v":2.6},2.58,2.6,2.6,2.6,2.6,2.6,2.6,2.6,2.6,2.5700000000000003,2.5649999999999999,2.56]
[1,2.859999999999983,3.4806400000000148,3.495640000000015,3.5156799999999926,3.5306799999999927,2.9025000000000012,2.9175000000000013,{"$f":"IF($B$7=constants!$C$60,G362,IF($B$8=constants!$C$60,C362,E362))","v":3.4806400000000148},{"$f":"IF($B$7=constants!$C$60,H362,IF($B$8=constants!$C$60,D362,F362))","v":3.495640000000015},1,3.4806400000000148,2.6,2.6,{"$f":"IF(OR($B$22=constants!$B$60,AND(I362>$B$12,$B$12<>-1)),O361+(N362-O361)*$O$74,O361+(L362-O361)*$O$74)","v":2.6},2.58,2.6,2.6,2.6,2.6,2.6,2.6,2.6,2.6,2.5700000000000003,2.5649999999999999,2.56]
[1,2.8699999999999828,3.4718800000000147,3.4868800000000149,3.5200599999999924,3.5350599999999925,2.9015000000000013,2.9165000000000014,{"$f":"IF($B$7=constants!$C$60,G363,IF($B$8=constants!$C$60,C363,E363))","v":3.4718800000000147},{"$f":"IF($B$7=constants!$C$60,H363,IF($B$8=constants!$C$60,D363,F363))","v":3.4868800000000149},1,3.4718800000000147,2.6,2.6,{"$f":"IF(OR($B$22=constants!$B$60,AND(I363>$B$12,$B$12<>-1)),O362+(N363-O362)*$O$74,O362+(L363-O362)*$O$74)","v":2.6},2.58,2.6,2.6,2.6,2.6,2.6,2.6,2.6,2.6,2.5700000000000003,2.5649999999999999,2.56]
[1,2.8799999999999826,3.4631200000000151,3.4781200000000152,3.5244399999999922,3.5394399999999924,2.9005000000000014,2.9155000000000015,{"$f":"IF($B$7=constants!$C$60,G364,IF($B$8=constants!$C$60,C364,E364))","v":3.4631200000000151},{"$f":"IF($B$7=constants!$C$60,H364,IF($B$8=constants!$C$60,D364,F364))","v":3.4781200000000152},1,3.4631200000000151,2.6,2.6,{"$f":"IF(OR($B$22=constants!$B$60,AND(I364>$B$12,$B$12<>-1)),O363+(N364-O363)*$O$74,O363+(L364-O363)*$O$74)","v":2.6},2.58,2.6,2.6,2.6,2.6,2.6,2.6,2.6,2.6,2.5700000000000003,2.5649999999999999,2.56]
[1,2.8899999999999824,3.4543600000000154,3.4693600000000155,3.5288199999999921,3.5438199999999922,2.8995000000000015,2.9145000000000016,{"$f":"IF($B$7=constants!$C$60,G365,IF($B$8=constants!$C$60,C365,E365))","v":3.4543600000000154},{"$f":"IF($B$7=constants!$C$60,H365,IF($B$8=constants!$C$60,D365,F365))","v":3.4693600000000155},1,3.4543600000000154,2.6,2.6,{"$f":"IF(OR($B$22=constants!$B$60,AND(I365>$B$12,$B$12<>-1)),O364+(N365-O364)*$O$74,O364+(L365-O364)*$O$74)","v":2.6},2.58,2.6,2.6,2.6,2.6,2.6,2.6,2.6,2.6,2.5700000000000003,2.5649999999999999,2.56]
[1,2.8999999999999821,3.4456000000000153,3.4606000000000154,3.5331999999999919,3.548199999999992,2.8985000000000016,2.9135000000000018,{"$f":"IF($B$7=constants!$C$60,G366,IF($B$8=constants!$C$60,C366,E366))","v":3.4456000000000153},{"$f":"IF($B$7=constants!$C$60,H366,IF($B$8=constants!$C$60,D366,F366))","v":3.4606000000000154},1,3.4456000000000153,2.6,2.6,{"$f":"IF(OR($B$22=constants!$B$60,AND(I366>$B$12,$B$12<>-1)),O365+(N366-O365)*$O$74,O365+(L366-O365)*$O$74)","v":2.6},2.58,2.6,2.6,2.6,2.6,2.6,2.6,2.6,2.6,2.5700000000000003,2.5649999999999999,2.56]
[1,2.9099999999999819,3.4368400000000157,3.4518400000000158,3.5375799999999922,3.5525799999999923,2.8975000000000013,2.9125000000000014,{"$f":"IF($B$7=constants!$C$60,G367,IF($B$8=constants!$C$60,C367,E367))","v":3.4368400000000157},{"$f":"IF($B$7=constants!$C$60,H367,IF($B$8=constants!$C$60,D367,F367))","v":3.4518400000000158},1,3.4368400000000157,2.6,2.6,{"$f":"IF(OR($B$22=constants!$B$60,AND(I367>$B$12,$B$12<>-1)),O366+(N367-O366)*$O$74,O366+(L367-O366)*$O$74)","v":2.6},2.58,2.6,2.6,2.6,2.6,2.6,2.6,2.6,2.6,2.5700000000000003,2.5649999999999999,2.56]
[1,2.9199999999999817,3.4280800000000156,3.4430800000000157,3.541959999999992,3.5569599999999921,2.8965000000000014,2.9115000000000015,{"$f":"IF($B$7=constants!$C$60,G368,IF($B$8=constants!$C$60,C368,E368))","v":3.4280800000000156},{"$f":"IF($B$7=constants!$C$60,H368,IF($B$8=constants!$C$60,D368,F368))","v":3.4430800000000157},1,{"$f":"IF($K368=0,IF($I368>$B$16,L367+($I368-L367)*L$74-J$72,L367-L367/L$74),IF($I368>$B$17,L367+($I368-L367)*L$74-J$72,L367-L367/L$74))","v":3.4280800000000156},2.6,2.6,{"$f":"IF(OR($B$22=constants!$B$60,AND(I368>$B$12,$B$12<>-1)),O367+(N368-O367)*$O$74,O367+(L368-O367)*$O$74)","v":2.6},2.58,{"$f":"IF($K368=0,IF($I368>$B$16,R367+($B$21-R367)*R$74-R$72,R367-R367/R$74),IF($I368>$B$17,R367+($B$21-R367)*R$74-R$72,R367-R367/R$74))","v":2.6},2.6,2.6,2.6,2.6,2.6,2.6,2.6,2.5700000000000003,2.5649999999999999,2.56]
[1,2.9299999999999815,3.4193200000000159,3.434320000000016,3.5463399999999918,{"$f":"E369+$F$74","v":3.561339999999992},2.8955000000000015,2.9105000000000016,{"$f":"IF($B$7=constants!$C$60,G369,IF($B$8=constants!$C$60,C369,E369))","v":3.4193200000000159},{"$f":"IF($B$7=constants!$C$60,H369,IF($B$8=constants!$C$60,D369,F369))","v":3.434320000000016},1,3.4193200000000159,2.6,2.6,{"$f":"IF(OR($B$22=constants!$B$60,AND(I369>$B$12,$B$12<>-1)),O368+(N369-O368)*$O$74,O368+(L369-O368)*$O$74)","v":2.6},2.58,2.6,2.6,2.6,2.6,2.6,2.6,2.6,2.6,2.5700000000000003,2.5649999999999999,2.56]
[1,2.9399999999999813,3.4105600000000162,3.4255600000000164,3.5507199999999917,3.5657199999999918,2.8945000000000016,2.9095000000000018,{"$f":"IF($B$7=constants!$C$60,G370,IF($B$8=constants!$C$60,C370,E370))","v":3.4105600000000162},{"$f":"IF($B$7=constants!$C$60,H370,IF($B$8=constants!$C$60,D370,F370))","v":3.4255600000000164},1,3.4105600000000162,{"$f":"IF($K370=0,IF($I370>$B$16,M369+($B$20-M369)*M$74-K$72,M369-M369/M$74),IF($I370>$B$17,M369+($B$20-M369)*M$74-K$72,M369-M369/M$74))","v":2.6},2.6,{"$f":"IF(OR($B$22=constants!$B$60,AND(I370>$B$12,$B$12<>-1)),O369+(N370-O369)*$O$74,O369+(L370-O369)*$O$74)","v":2.6},2.58,2.6,2.6,2.6,2.6,2.6,2.6,2.6,2.6,2.5700000000000003,2.5649999999999999,2.56]
[1,2.9499999999999811,3.4018000000000161,3.4168000000000163,3.5550999999999915,3.5700999999999916,2.8935000000000017,2.9085000000000019,{"$f":"IF($B$7=constants!$C$60,G371,IF($B$8=constants!$C$60,C371,E371))","v":3.4018000000000161},{"$f":"IF($B$7=constants!$C$60,H371,IF($B$8=constants!$C$60,D371,F371))","v":3.4168000000000163},1,3.4018000000000161,2.6,2.6,{"$f":"IF(OR($B$22=constants!$B$60,AND(I371>$B$12,$B$12<>-1)),O370+(N371-O370)*$O$74,O370+(L371-O370)*$O$74)","v":2.6},2.58,2.6,2.6,2.6,2.6,2.6,2.6,2.6,2.6,2.5700000000000003,2.5649999999999999,2.56]
[1,2.9599999999999809,3.3930400000000165,3.4080400000000166,3.5594799999999918,3.5744799999999919,2.8925000000000014,2.9075000000000015,{"$f":"IF($B$7=constants!$C$60,G372,IF($B$8=constants!$C$60,C372,E372))","v":3.3930400000000165},{"$f":"IF($B$7=constants!$C$60,H372,IF($B$8=constants!$C$60,D372,F372))","v":3.4080400000000166},1,3.3930400000000165,2.6,2.6,{"$f":"IF(OR($B$22=constants!$B$60,AND(I372>$B$12,$B$12<>-1)),O371+(N372-O371)*$O$74,O371+(L372-O371)*$O$74)","v":2.6},2.58,2.6,2.6,2.6,2.6,2.6,2.6,2.6,2.6,2.5700000000000003,2.5649999999999999,2.56]
[1,2.9699999999999807,3.3842800000000168,{"$f":"C373+$D$74","v":3.399280000000017},3.5638599999999911,3.5788599999999913,2.8915000000000015,2.9065000000000016,{"$f":"IF($B$7=constants!$C$60,G373,IF($B$8=constants!$C$60,C373,E373))","v":3.3842800000000168},{"$f":"IF($B$7=constants!$C$60,H373,IF($B$8=constants!$C$60,D373,F373))","v":3.399280000000017},1,3.3842800000000168,2.6,2.6,{"$f":"IF(OR($B$22=constants!$B$60,AND(I373>$B$12,$B$12<>-1)),O372+(N373-O372)*$O$74,O372+(L373-O372)*$O$74)","v":2.6},2.58,2.6,2.6,2.6,2.6,2.6,2.6,2.6,2.6,2.5700000000000003,2.5649999999999999,2.56]
[1,2.9799999999999804,3.3755200000000167,3.3905200000000169,3.5682399999999914,3.5832399999999915,2.8905000000000016,2.9055000000000017,{"$f":"IF($B$7=constants!$C$60,G374,IF($B$8=constants!$C$60,C374,E374))","v":3.3755200000000167},{"$f":"IF($B$7=constants!$C$60,H374,IF($B$8=constants!$C$60,D374,F374))","v":3.3905200000000169},1,3.3755200000000167,2.6,2.6,{"$f":"IF(OR($B$22=constants!$B$60,AND(I374>$B$12,$B$12<>-1)),O373+(N374-O373)*$O$74,O373+(L374-O373)*$O$74)","v":2.6},2.58,2.6,2.6,2.6,2.6,2.6,2.6,2.6,2.6,2.5700000000000003,2.5649999999999999,2.56]
[1,2.9899999999999802,3.3667600000000171,3.3817600000000172,3.5726199999999912,3.5876199999999914,2.8895000000000017,2.9045000000000019,{"$f":"IF($B$7=constants!$C$60,G375,IF($B$8=constants!$C$60,C375,E375))","v":3.3667600000000171},{"$f":"IF($B$7=constants!$C$60,H375,IF($B$8=constants!$C$60,D375,F375))","v":3.3817600000000172},1,3.3667600000000171,2.6,2.6,{"$f":"IF(OR($B$22=constants!$B$60,AND(I375>$B$12,$B$12<>-1)),O374+(N375-O374)*$O$74,O374+(L375-O374)*$O$74)","v":2.6},2.58,2.6,2.6,2.6,2.6,2.6,2.6,2.6,2.6,2.5700000000000003,2.5649999999999999,2.56]
[1,2.99999999999998,3.358000000000017,3.3730000000000171,3.5769999999999911,3.5919999999999912,2.8885000000000018,2.903500000000002,{"$f":"IF($B$7=constants!$C$60,G376,IF($B$8=constants!$C$60,C376,E376))","v":3.358000000000017},{"$f":"IF($B$7=constants!$C$60,H376,IF($B$8=constants!$C$60,D376,F376))","v":3.3730000000000171},1,3.358000000000017,2.6,2.6,{"$f":"IF(OR($B$22=constants!$B$60,AND(I376>$B$12,$B$12<>-1)),O375+(N376-O375)*$O$74,O375+(L376-O375)*$O$74)","v":2.6},2.58,2.6,2.6,2.6,2.6,2.6,2.6,2.6,2.6,2.5700000000000003,2.5649999999999999,2.56]