{"text_format":"1","workbook":"xlsx","n_sheets":7,"sheets":["settings","register map","timing diagram","constants","messages","txt source","chart calc"],"not_rendered":{"charts":2,"images":4,"macros":1,"external_links":0,"defined_names":3,"comments":0,"pivot_tables":0},"unopened":[{"sheet":"timing diagram","index":2,"reason":"not_a_worksheet"}],"bounds":{"document_bytes":16777216,"sheet_cells":100000,"rows_first":2000,"rows_last":500,"rows_between":2000,"halvings":0,"cell_chars":16384,"cell_head_chars":4096},"cells_cut":0,"cells_raw":0,"read":"whole","date_system":"1900"}

{"sheet":"settings","index":0,"n_rows":160,"n_cols":11,"rows_kept":160,"cut":false,"hidden":false,"merged":[[7,0,7,10],[0,0,0,10],[1,4,1,5],[2,4,2,5],[3,4,4,5],[1,6,4,10],[2,1,2,3],[1,1,1,3],[3,1,3,3],[4,1,4,3],[5,1,5,10],[56,0,56,10],[62,0,62,10],[71,0,71,10],[33,0,33,10],[44,0,44,10],[39,0,39,10],[34,0,34,10],[38,0,38,10],[43,0,43,10],[26,0,26,10],[19,0,19,10],[15,0,15,10],[12,0,12,10],[8,0,8,10],[11,0,11,10],[25,0,25,10],[132,0,132,10],[127,0,127,10],[122,0,122,10],[111,0,111,10],[121,0,121,10],[131,0,131,10],[97,0,97,10],[80,0,80,10],[72,0,72,10],[63,0,63,10],[57,0,57,10],[85,0,85,10],[81,0,81,10],[78,0,78,10],[89,0,92,0],[89,5,92,5],[84,0,84,10],[77,0,77,10],[66,0,66,10]]}
["EM8502 ADVANCED WIZARD"]
["Author","EM-Microelectronic SA",null,null,"User settings"]
["Date:","2025-11-17",null,null,"Calculation results"]
["Description:","Setup the initial value of the configuration registers",null,null,{"$f":"IF(COUNTIF('register map'!F3:F28,\"\")<>26,messages!A64,IF(COUNTIF(F10:F160,\"ERROR*\")>0,messages!A41,IF(COUNTIF(F10:F160,\"WARNING*\")>0,messages!A66,messages!A78)))","v":"OK"}]
["Revision:",2.2999999999999998]
["Configuration description:"]
["Parameter","Value","Unit","Related Register Name","Value","Check","Note","DEC","WEIGHT",null,"User comments"]
["HARVESTER SETTINGS"]
["Harvester type: refer to the chapter 2.1 of e8500_app_note_hrv_param.pdf"]
["Harvester type","Solar cell","--",null,null,{"$f":"messages!A78","v":"OK"}]
["MPPT ratio",0.8,"--","reg_mppt_ratio ",{"$f":"HLOOKUP(B11,constants!B2:N4,3,FALSE)","v":"0x06"},{"$f":"IF(B10=\"TEG\",IF(B11=0.5,messages!A78,messages!A50),IF(B10=\"Other\",messages!A78,IF(settings!B11<constants!G2,messages!A51,IF(settings!B11>constants!I2,messages!A51,messages!A78))))","v":"OK"}]
[]
["Battery over voltage control"]
["HRV check method",{"$f":"IF(B10=constants!B1,constants!C8,constants!B8)","v":"Short-cut current"},"--","reg_v_hrv_cfg.hrv_check_vld",{"$f":"HLOOKUP(B14,constants!$B$8:$C$9,2,FALSE)","v":"'0'"},{"$f":"IF(AND(B14=constants!B8,settings!B10=constants!B1),messages!A53,IF(AND(settings!B14=constants!C8,settings!B10=constants!C1),messages!A52,messages!A78))","v":"OK"},"Open voltage is preferable for TEG ; Short cut current preferable for Solar cell",{"$f":"HLOOKUP(B14,constants!$B$8:$C$10,3,FALSE)","v":0},64]
["Maximum battery voltage v_bat_max_hi",2.8,"V","reg_v_bat_max_hi",{"$f":"IF((TRUNC(B15/constants!D64-1)+1)>9,\"0x\"&DEC2HEX(TRUNC(B15/constants!D64-1)+1),\"0x0\"&DEC2HEX(TRUNC(B15/constants!D64-1)+1))","v":"0x24"},{"$f":"IF(B15>constants!D67,messages!A14,messages!A78)","v":"OK"},null,{"$f":"(TRUNC(B15/constants!D64-1)+1)","v":36},1]
["Harvester check settings for a TEG: refer to the chapter 2.2.1 of e8500_app_note_hrv_param.pdf"]
[{"$f":"IF(B14=constants!C8,\"Unused\",\"HRV resistivity (Rteg)\")","v":"Unused"},300,"Ω",null,null,{"$f":"IF(AND(B14=constants!B8,B15<=2,B17>MAX(constants!B15:B18)),messages!A5,IF(AND(B14=constants!B8,settings!B15<=3,B15>2,settings!B17>MAX(constants!C15:C18)),messages!A4,IF(AND(B14=constants!B8,B15>3,settings!B17>MAX(constants!D15:D18)),messages!A3,IF(B14<>constants!B8,messages!A79,messages!A78))))","v":"OK (Not applicable)"}]
["Minimum HRV open voltage",{"$f":"IF(B14<>constants!B8,messages!A79,IF(B10=constants!C1,IF(B15<=2,IF(B17<=constants!B15,constants!E15,IF(settings!B17<=constants!B16,constants!E16,IF(settings!B17<=constants!B17,constants!E17,IF(settings!B17<=constants!B18,constants!E18,constants!B19)))),IF(B15<=3,IF(B17<=constants!C15,constants!E15,IF(settings!B17<=constants!C16,constants!E16,IF(settings!B17<=constants!C17,constants!E17,IF(settings!B17<=constants!C18,constants!E18,constants!C19)))),IF(B17<=constants!D15,constants!E15,IF(settings!B17<=constants!D16,constants!E16,IF(settings!B17<=constants!D17,constants!E17,IF(settings!B17<=constants!D18,constants!E18,constants!D19)))))),messages!A79))","v":"OK (Not applicable)"},"mV","reg_v_hrv_cfg.v_hrv_min",{"$f":"IF(B18<>messages!A79,VLOOKUP(B18,constants!E15:F18,2,FALSE),\"0x01\")","v":"0x01"},null,"Below that level the EM8500 DCDC is deactivated",{"$f":"IF(B18<>messages!A79,VLOOKUP(B18,constants!E15:G18,3,FALSE),1)","v":1},1]
["Pin_min",{"$f":"IF(B18=messages!A79,messages!A79,IF(B18=constants!B19,constants!B19,1000000*(0.001*settings!B18)^2/(4*settings!B17)))","v":"OK (Not applicable)"},"uW",null,null,null,"Minimum power the EM8500 can harvest in such condition"]
["Solar cell definition: refer to the chapter 2.2.2 of  \"App Note 85 Configuration\""]
["Voc_min",3.6,"V",null,null,{"$f":"IF(B21>constants!D22,messages!A6,IF(B21<constants!B22,messages!A7,messages!A78))","v":"OK"},"Total solar cell segments open voltage"]
["Vmpp_min",{"$f":"IF(B21<0.2,0.2,VLOOKUP(ROUND(B21*B11,1),constants!A27:A40,1,TRUE))","v":1.45},"V",null,null,{"$f":"IF(B14<>constants!C8,messages!A79,IF(B15<=2,IF(VLOOKUP(B22,constants!A27:B40,2,FALSE)=constants!B19,messages!A8,messages!A78),IF(B15<=3,IF(VLOOKUP(B22,constants!A27:C40,3,FALSE)=constants!B19,messages!A8,messages!A78),IF(VLOOKUP(B22,constants!A27:D40,4,FALSE)=constants!B19,messages!A8,messages!A78))))","v":"OK"}]
["Ihrv_lim absolute min",{"$f":"IF(B14<>constants!C8,messages!A79,IF(settings!F22<>messages!A78,constants!B19,IF(settings!B15<=2,VLOOKUP(settings!B22,constants!A27:B40,2,FALSE),IF(settings!B15<=3,VLOOKUP(settings!B22,constants!A27:C40,3,FALSE),VLOOKUP(settings!B22,constants!A27:D40,4,FALSE)))))","v":1},"uA",null,null,null,"Below that level the EM8500 DCDC is deactivated"]
["Ihrv_lim effective",3,"uA","reg_hrv_check_lvl",{"$f":"IF(B14<>constants!C8,\"0x00\",IF(B24<B23,constants!B19,HLOOKUP(settings!B24,constants!B42:Q43,2,FALSE)))","v":"0x02"},{"$f":"IF(settings!B14<>constants!C8,messages!A79,IF(settings!B24<settings!B23,messages!A10,messages!A78))","v":"OK"},"Minimum short-cut current under which harvesting  stops"]
["Pin_min",{"$f":"IF(B14<>constants!C8,messages!A79,IF(settings!F22<>messages!A78,constants!B19,settings!B24*settings!B22))","v":4.3499999999999996},"uW"]
[]
["Harvester check timing settings: refer to the chapter 2.2.3 & 2.2.4 of  \"App Note 85 Configuration\""]
["HRV capacitor (Chrv)",2.2000000000000002,"uF",null,null,{"$f":"IF(OR(B28<constants!B46,B28>constants!D46),messages!A9,messages!A78)","v":"OK"}]
["Thrv_meas ideal",{"$f":"1","v":1},"ms"]
["Thrv_meas effective",64,"ms","reg_t_hrv_meas",{"$f":"VLOOKUP(B30,constants!B51:D58,3,FALSE)","v":"0x02"},{"$f":"IF(B29>constants!B58,messages!A11,IF(B29>B30,messages!A12,messages!A78))","v":"OK"},{"$f":"\"Shall be closer and just higher than Thrv_meas_ideal: \"&IF(B29<=constants!B51,constants!B51,IF(B29<=constants!B52,constants!B52,IF(B29<=constants!B53,constants!B53,IF(B29<=constants!B54,constants!B54,IF(B29<=constants!B55,constants!B55,IF(B29<=constants!B56,constants!B56,IF(B29<=constants!B57,constants!B57,constants!B58)))))))&\" ms\"","v":"Shall be closer and just higher than Thrv_meas_ideal: 16 ms"}]
["Thrv_period",1024,"ms","reg_t_hrv_period",{"$f":"VLOOKUP(B31,constants!C51:D58,2,FALSE)","v":"0x02"},{"$f":"IF(B31<2*$B$30,messages!$A$13,IF(B31<16*$B$30,messages!$A$54,messages!$A$78))","v":"OK"}]
["Efficiency loss @ Pin_min due to HRV control",{"$f":"B30/B31","v":6.25E-2},"%"]
["Thrv_period in HRV LOW mode",1024,"ms","reg_t_hrv_low_cfg.t_hrv_low_period ",{"$f":"VLOOKUP(B33,constants!C51:E58,3,FALSE)","v":"\"010\""},{"$f":"messages!A68&TRUNC(30000/(8*B33))/10&\" nW\"","v":"Note: the power consumption of the HRV supervisory & sampling in HRV LOW mode is: 0.3 nW"},null,{"$f":"VLOOKUP(B33,constants!C51:F58,4,FALSE)","v":2},16]
["STORAGE SUPERVISORY SETTINGS"]
["Operating mode selection: refer to the chapter 4 of \"App Note 85 Storage\""]
["Rechargeable battery","Yes","--","reg_lts_cfg.prim_cell",{"$f":"IF(B36=constants!$B$60,\"'0'\",\"'1'\")","v":"'0'"},null,"Set Yes if LTS is a secondary cell or a super capacitor ; set No if LTS is a primary cell",{"$f":"IF(B36=constants!$B$60,0,1)","v":0},2]
["Under voltage protection","Yes","--","reg_lts_cfg.no_bat_protect",{"$f":"IF(B37=constants!$B$60,\"'0'\",\"'1'\")","v":"'0'"},{"$f":"IF(B37=constants!C60,messages!A56,messages!A78)","v":"OK"},"Set Yes if LTS shall be disconnected in under voltage condition to protect the battery",{"$f":"IF(B37=constants!$B$60,0,1)","v":0},1]
["LTS connected to STS at start-up (in prim_cell mode only)","No","--","reg_lts_cfg.prim_cell_connect",{"$f":"IF(B38=constants!$B$60,\"'1'\",\"'0'\")","v":"'0'"},null,"Set Yes if LTS shall be connected to STS at start-up or after a soft-reset",{"$f":"IF(B38=constants!$B$60,1,0)","v":0},4]
[]
["Absolute min/max selection: refer to the chapter 5 of \"App Note 85 Storage\""]
["Maximum battery voltage v_bat_max_hi",{"$f":"B15","v":2.8},"V","reg_v_bat_max_hi",{"$f":"IF(H41>9,\"0x\"&DEC2HEX(H41),\"0x0\"&DEC2HEX(H41))","v":"0x24"},{"$f":"IF(B41<=B43+3*constants!C64,messages!A18,messages!A78)","v":"OK"},"Set the absolute maximum voltage the battery can afford",{"$f":"H15","v":36},1]
["Maximum application voltage:",4.2,"V","reg_v_apl_max_hi",{"$f":"IF(H42>9,\"0x\"&DEC2HEX(H42),\"0x0\"&DEC2HEX(H42))","v":"0x3F"},{"$f":"IF(AND(H42<>63,H42>=(H41-1)),messages!A34,IF(B42<=B43+3*constants!C64,messages!A15,IF(B42>constants!D67,messages!A16,messages!A78)))","v":"OK"},"Set the absolute maximum voltage the application can afford",{"$f":"IF(B42<B41,(TRUNC(B42/constants!D64-1)+1),63)","v":63},1]
["Minimum battery and application voltage:",1.7,"V","reg_v_bat_min_lo",{"$f":"IF(H43>9,\"0x\"&DEC2HEX(H43),\"0x0\"&DEC2HEX(H43))","v":"0x18"},{"$f":"IF(B43<constants!B68,messages!A17,messages!A78)","v":"OK"},"Set the absolute minimum voltage the battery can afford",{"$f":"(TRUNC(B43/constants!B64-1)+1)","v":24},1]
[]
["Csts capacitor selection: refer to the chapter 6 of \"App Note 85 Storage\""]
["STS always connected to LTS","Yes","--",null,null,{"$f":"IF(AND(B36=constants!C60,B46=constants!B60),messages!A55,messages!A78)","v":"OK"},"Set No in primary cell mode or if STS shall supply the application without any help from LTS in some condition"]
["Capacitor on VSUP (Csup)",1,"uF",null,null,{"$f":"IF(OR(B96=constants!B60,settings!H42<63),IF(B47<constants!B71,messages!A19,messages!$A$78),messages!A78)","v":"OK"},"Minimum capacity allowed is 1uF"]
["Capacitor on VAUX[0] (Caux0)",1,"uF",null,null,{"$f":"IF(OR(B105=constants!$B$124,AND(settings!B105=constants!$D$124,settings!$H$42=63),AND(B105=constants!$E$124,$H$42=63)),messages!$A$78,IF(B48<constants!B72,messages!A20,messages!$A$78))","v":"OK"},"Minimum capacity allowed is 1uF if VAUX[0] used"]
["Capacitor on VAUX[1] (Caux1)",1,"uF",null,null,{"$f":"IF(OR(B106=constants!$B$124,AND(settings!B106=constants!$D$124,settings!$H$42=63),AND(B106=constants!$E$124,$H$42=63)),messages!$A$78,IF(B49<constants!B73,messages!A21,messages!$A$78))","v":"OK"},"Minimum capacity allowed is 1uF if VAUX[1] used"]
["Capacitor on VAUX[2] (Caux2)",1,"uF",null,null,{"$f":"IF(OR(B107=constants!$B$124,AND(settings!B107=constants!$D$124,settings!$H$42=63),AND(B107=constants!$E$124,$H$42=63)),messages!$A$78,IF(B50<constants!B74,messages!A22,messages!$A$78))","v":"OK"},"Minimum capacity allowed is 1uF if VAUX[2] used"]
["Csup switched on with other cap","Yes","--",null,null,null,"Set \"Yes\" if Csup can be enabled together with others VAUX"]
["Caux0 switched on with other cap","Yes","--",null,null,null,"Set \"Yes\" if Caux0 can be enabled together with VSUP or others VAUX"]
["Caux1 switched on with other cap","No","--",null,null,null,"Set \"Yes\" if Caux1 can be enabled together with VSUP or others VAUX"]
["Caux2 switched on with other cap","No","--",null,null,null,"Set \"Yes\" if Caux2 can be enabled together with VSUP or others VAUX"]
["Minimum Csts allowed",{"$f":"IF(B46=constants!C60,10*(IF(B51=constants!B60,B47,0)+IF(B52=constants!B60,B48,0)+IF(B53=constants!B60,B49,0)+IF(B54=constants!B60,B50,0)),constants!B75)","v":10},"uF"]
["Capacitor on STS (Csts)",47,"uF",null,null,{"$f":"IF(B56<B55,messages!A23,messages!A78)","v":"OK"}]
[]
["STS survey period: refer to the chapter 7 of \"App Note 85 Storage\""]
["Minimum input power: Pin_min",{"$f":"IF(B14=constants!B8,settings!B19,settings!B25)","v":4.3499999999999996},"uW"]
["Maximum power loss @Pin_min in VLD allowed: VLDloss",0.2,"%"]
["Minimum Tsts_period",{"$f":"IF((0.000003/(4*(B59/1000000)*B60))<1,1,0.000003/(4*(B59/1000000)*B60))","v":1},"ms",null,null,{"$f":"IF(B61>constants!B85,messages!A25,messages!A78)","v":"OK"}]
["Effective Tsts_period",1,"ms","reg_t_sts_period",{"$f":"\"0x0\"&VLOOKUP(B62,constants!B78:D85,3,FALSE)","v":"0x00"},{"$f":"IF(B62<B61,messages!A26,messages!A78)","v":"OK"},{"$f":"\"Shall be closer and just higher than Thrv_meas_ideal: \"&IF(B61<=constants!B78,constants!B78,IF(B61<=constants!B79,constants!B79,IF(B61<=constants!B80,constants!B80,IF(B61<=constants!B81,constants!B81,IF(B61<=constants!B82,constants!B82,IF(B61<=constants!B83,constants!B83,IF(B61<=constants!B84,constants!B84,constants!B85)))))))&\" ms\"","v":"Shall be closer and just higher than Thrv_meas_ideal: 1 ms"}]
[]
["Hysteresis v_bat_min STS/LTS disconnected: refer to the chapter 8 of \"App Note 85 Storage\""]
["Max avrg. consumption of the application when STS/LTS disconnected: Imax",0.1,"mA",null,null,null,"Maximum consumption of application when STS & LTS disconnected"]
["High level of v_bat_min: LTS/STS disconnected",{"$f":"IF(B46=constants!B60,(settings!H66+1)*constants!D64,2*(B62/1000)*(B65/1000)/(B56/1000000)+((TRUNC(B43/constants!B64-1)+1)+1)*constants!D64)","v":2.06955},"V","reg_v_bat_min_hi_dis",{"$f":"IF(H66>9,\"0x\"&DEC2HEX(H66),\"0x0\"&DEC2HEX(H66))","v":"0x1A"},{"$f":"IF(AND(H66<H42,H66<H41),messages!A78,IF(B46=\"No\",messages!A27,messages!A78))","v":"OK"},null,{"$f":"IF(B46=constants!B60,settings!H71,IF((TRUNC(B66/constants!D64-1)+1)<H71,H71,(TRUNC(B66/constants!D64-1)+1)))","v":26},1]
["Hysteresis v_bat_min STS/LTS connected: refer to the chapter 4 of \"App Note 85 Current\""]
["Average consumption of the application when STS/LTS connected: Istd",1,"mA",null,null,null,"Average consumption of application when STS & LTS connected"]
["Peak consumption of the application when STS/LTS connected: Ipeak",10,"mA",null,null,null,"Peak consumption of application when STS & LTS connected"]
["Battery/super cap internal resistivity",10,"Ω",null,null,null,"Internal resistivity of the battery or super cap"]
["High level of v_bat_min: LTS/STS connected",{"$f":"(H71+1)*constants!D64","v":2.06955},"V","reg_v_bat_min_hi_con",{"$f":"IF(H71>9,\"0x\"&DEC2HEX(H71),\"0x0\"&DEC2HEX(H71))","v":"0x1A"},{"$f":"IF(AND(H71<H77,H71<H80),messages!A78,messages!A29)","v":"OK"},null,{"$f":"TRUNC((B69-B68)*(B70+constants!E201)/(constants!B64*1000))+settings!H43+1","v":26},1]
[]
["Level v_apl_max_lo: refer to the chapter 9 of  \"App Note 85 Storage\""]
["Maximum Vmpp",3.2,"V",null,null,null,"Vmpp in best case condition (higher luminescence in case of solar cell for instance)"]
["Min LTS charge time",100,"ms",null,null,null,"Minimum delay to charge LTS at maximum application consumption",{"$f":"TRUNC(39*constants!D64/constants!D64-1)","v":38}]
["Maximum input power from the solar cell",10,"mW",null,null,null,"Maximum input power from the solar cell"]
["Low level of v_apl_max",{"$f":"IF(H42=63,B42,IF(B46=constants!C60,IF(4*(B62/1000)*(B76/1000)/(B56/1000000)>B42^2,constants!B19,IF((B42-SQRT(B42^2-4*(B62/1000)*(B76/1000)/(B56/1000000)))>constants!D64,SQRT(B42^2-4*(B62/1000)*(B76/1000)/(B56/1000000)),H42*constants!D64)),(H77+1)*constants!B64))","v":4.2},"V","reg_v_apl_max_lo",{"$f":"IF(H77>15,\"0x\"&DEC2HEX(H77),\"0x0\"&DEC2HEX(H77))","v":"0x3E"},{"$f":"IF(OR(AND(H42<>63,H77<=H66),AND(H42<>63,H77<=H71)),messages!A28,IF(B77=constants!B19,messages!A30,IF(H42=63,messages!A78,IF(B46=constants!C60,IF(OR((H77+1)*constants!D64<((B75/1000)*(B65/1000)/(B56/1000000)+B66),H77>=H42),messages!A31,messages!A78),IF(H77<=H71,messages!A32,messages!A78)))))","v":"OK"},null,{"$f":"IF(H42=63,62,IF(B46=constants!C60,IF(B77=constants!B19,H42-1,IF((B42-SQRT(B42^2-4*(B62/1000)*(B76/1000)/(B56/1000000)))>constants!D64,(TRUNC(B77/constants!D64-1)+1),H42-1)),H42-1))","v":62},1]
[]
["Level v_bat_max_lo: refer to the chapter 10 of  \"App Note 85 Storage\""]
["Low level of v_bat_max",{"$f":"IF(H42=63,IF(B46=constants!C60,IF(4*(B62/1000)*(B76/1000)/(B56/1000000)>B41^2,constants!B19,IF((B41-SQRT(B41^2-4*(B62/1000)*(B76/1000)/(B56/1000000)))>constants!D64,SQRT(B41^2-4*(B62/1000)*(B76/1000)/(B56/1000000)),H41*constants!D64)),H41*constants!D64),H41*constants!D64)","v":2.7593999999999999},"V","reg_v_bat_max_lo",{"$f":"IF(B80=constants!B19,constants!B19,IF(H80>15,\"0x\"&DEC2HEX(H80),\"0x0\"&DEC2HEX(H80)))","v":"0x23"},{"$f":"IF(AND(H80<=H42,H42<>63),messages!A35,IF(B80=constants!B19,messages!A33,IF(H42=63,IF(B46=constants!C60,IF(OR((H80+1)*constants!D64<((B75/1000)*(B65/1000)/(B56/1000000)+B66),H80>=H41),messages!A33,messages!A78),IF(H80<=H71,messages!A36,messages!A78)),IF(H80<=H71,messages!A36,messages!A78))))","v":"OK"},null,{"$f":"IF(B80=constants!B19,constants!B19,IF(H42=63,IF(B46=constants!C60,IF((B42-SQRT(B42^2-4*(B62/1000)*(B76/1000)/(B56/1000000)))>constants!D64,(TRUNC(B80/constants!D64-1)+1),H41-1),H41-1),H41-1))","v":35},1]
[]
["LTS survey period: refer to the chapter 11 of  \"App Note 85 Storage\""]
["Tlts_period",16,"ms","reg_t_lts_period",{"$f":"\"0x0\"&VLOOKUP(B83,constants!B88:D95,3,FALSE)","v":"0x02"},{"$f":"messages!A69&(TRUNC(100*3000/(4*B83),0))/100&\" nW\"","v":"Note: the power consumption of the VLD used to measure LTS is: 46.87 nW"}]
["Tlts_period in HRV LOW mode",32,"ms","reg_t_hrv_low_cfg.t_lts_hrv_low_period ",{"$f":"VLOOKUP(B84,constants!B98:D105,3,FALSE)","v":"\"010\""},{"$f":"messages!A70&(TRUNC(100*3000/(4*B84),0))/100&\" nW\"","v":"Note: the power consumption of the VLD used to measure LTS in HRV LOW mode is: 23.43 nW"},null,{"$f":"VLOOKUP(B84,constants!B98:E105,4,FALSE)","v":2},1]
["SUPPLY OUTPUTS VSUP, VAUX, VAUX_GND CONTROL (Supply outputs VSUP, VAUX, VAUX_GND is described in e8500_app_note_supply_control.pdf)"]
["VSUP settings: refer to the chapter 2 of \"App Note 85 Supply Outputs\""]
["VSUP grounded when disabled","Yes","--","reg_ldo_cfg.vsup_tied_low",{"$f":"IF(B87=constants!$B$60,\"'1'\",\"'0'\")","v":"'1'"},null,null,{"$f":"IF(B87=constants!$B$60,1,0)","v":1},128]
["VSUP in sleep mode at start-up","Yes","--","reg_pwr_mgt.sleep_vsup",{"$f":"IF(B88=constants!$B$60,\"'1'\",\"'0'\")","v":"'1'"},{"$f":"IF(AND($B$88=constants!$B$60,settings!$B$94=constants!$B$109),messages!$A$65,messages!$A$78)","v":"OK"},null,{"$f":"IF(B88=constants!$B$60,1,0)","v":1},1]
["VSUP disabled in HRV LOW mode","No","--","reg_pwr_cfg.dis_vsup_hrv_low",{"$f":"IF(B89=constants!$B$60,\"'1'\",\"'0'\")","v":"'0'"},{"$f":"IF(B89=constants!B60,messages!A58,messages!A78)","v":"OK"},null,{"$f":"IF(B89=constants!$B$60,1,0)","v":0},1]
["Sleep counter delay",0,"h",null,null,{"$f":"IF(H90>HEX2DEC(\"FFFFFF\"),messages!A37,IF(H90=0,messages!A38,messages!A78))","v":"OK"},null,{"$f":"B93+1000*B92+1000*60*B91+1000*60*60*B90","v":1000}]
[null,0,"min","reg_t_sleep_vsup_hi",{"$f":"IF($F$90=messages!$A$78,IF(H91>15,\"0x\"&DEC2HEX(H91),\"0x0\"&DEC2HEX(H91)),constants!$B$19)","v":"0x00"},null,null,{"$f":"TRUNC(H90/2^16)","v":0},1]
[null,1,"s","reg_t_sleep_vsup_mid",{"$f":"IF($F$90=messages!$A$78,IF(H92>15,\"0x\"&DEC2HEX(H92),\"0x0\"&DEC2HEX(H92)),constants!$B$19)","v":"0x03"},null,null,{"$f":"TRUNC((H90-H91*2^16)/(2^8))","v":3},1]
[null,0,"ms","reg_t_sleep_vsup_lo",{"$f":"IF($F$90=messages!$A$78,IF(H93>15,\"0x\"&DEC2HEX(H93),\"0x0\"&DEC2HEX(H93)),constants!$B$19)","v":"0xE8"},null,null,{"$f":"H90-H91*2^16-H92*2^8","v":232},1]
["Wake-up active edge selection","falling edge","--","reg_ext_cfg.wake_up_edge_cfg",{"$f":"HLOOKUP(B94,constants!B109:E110,2,FALSE)","v":"\"01\""},{"$f":"IF(AND($B$88=constants!$B$60,settings!$B$94=constants!$B$109),messages!$A$65,messages!$A$78)","v":"OK"},null,{"$f":"HLOOKUP(B94,constants!B109:E111,3,FALSE)","v":1},16]
["Wake-up debouncer enabled","Yes","--","reg_ext_cfg.wake_up_deb_en",{"$f":"IF(B95=constants!B60,\"'1'\",\"'0'\")","v":"'1'"},null,null,{"$f":"IF(B95=constants!B60,1,0)","v":1},64]
["VSUP always connected to ULP LDO","No","--","reg_ldo_cfg.frc_ulp_ldo",{"$f":"IF(B96=constants!B60,\"'1'\",\"'0'\")","v":"'0'"},null,null,{"$f":"IF(B96=constants!B60,1,0)","v":0},8]
["ULP LDO level",2.6,"V","reg_ldo_cfg.v_ulp_ldo",{"$f":"VLOOKUP(B97,constants!B114:C121,2,FALSE)","v":"\"111\""},{"$f":"IF(B97>=B15,messages!A59,messages!A78)","v":"OK"},null,{"$f":"VLOOKUP(B97,constants!B114:D121,3,FALSE)","v":7},1]
["VAUX settings: refer to the chapter 3 of \"App Note 85 Supply Outputs\""]
["VAUX[0] used","No","--"]
["VAUX[1] used","No","--"]
["VAUX[2] used","No","--"]
["VAUX[0] enabled at start-up","No","--","reg_pwr_mgt.vaux0_en",{"$f":"IF(B102=constants!$B$60,\"'1'\",\"'0'\")","v":"'0'"},{"$f":"IF(AND(B99=constants!$C$60,settings!B102=constants!$B$60),messages!$A$40,messages!$A$78)","v":"OK"},null,{"$f":"IF(B102=constants!$B$60,1,0)","v":0},2]
["VAUX[1] enabled at start-up","No","--","reg_pwr_mgt.vaux1_en",{"$f":"IF(B103=constants!$B$60,\"'1'\",\"'0'\")","v":"'0'"},{"$f":"IF(AND(B100=constants!$C$60,settings!B103=constants!$B$60),messages!$A$40,messages!$A$78)","v":"OK"},null,{"$f":"IF(B103=constants!$B$60,1,0)","v":0},4]
["VAUX[2] enabled at start-up","No","--","reg_pwr_mgt.vaux2_en",{"$f":"IF(B104=constants!$B$60,\"'1'\",\"'0'\")","v":"'0'"},{"$f":"IF(AND(B101=constants!$C$60,settings!B104=constants!$B$60),messages!$A$40,messages!$A$78)","v":"OK"},null,{"$f":"IF(B104=constants!$B$60,1,0)","v":0},8]
["VAUX[0] connection configuration","to VDD_STS","--","reg_vaux_cfg.vaux0_cfg",{"$f":"HLOOKUP(B105,constants!$B$124:$E$125,2,FALSE)","v":"\"00\""},{"$f":"IF(B99=constants!C60,messages!A78,IF(AND(B105=constants!B124,settings!B96=constants!C60,settings!H42=63),messages!A78,IF(AND(B105=constants!$C$124,$B$96=constants!$B$60,$B$97=$B$108),messages!$A$78,IF(AND($B$96=constants!$C$60,OR(B105=constants!$D$124,B105=constants!$E$124)),messages!$A$78,messages!A60))))","v":"OK"},"To get the same voltage domain for VSUP and VAUX[0]; auto + frc_ulp_ldo = 0 OR  VAUX_LDO + frc_ulp_ldo = 1",{"$f":"HLOOKUP(B105,constants!$B$124:$E$126,3,FALSE)","v":0},1]
["VAUX[1] connection configuration","to VDD_STS","--","reg_vaux_cfg.vaux1_cfg",{"$f":"HLOOKUP(B106,constants!$B$124:$E$125,2,FALSE)","v":"\"00\""},{"$f":"IF(B100=constants!C60,messages!A78,IF(AND(B106=constants!B124,settings!B96=constants!C60,settings!H42=63),messages!A78,IF(AND(B106=constants!$C$124,$B$96=constants!$B$60,$B$97=$B$108),messages!$A$78,IF(AND($B$96=constants!$C$60,OR(B106=constants!$D$124,B106=constants!$E$124)),messages!$A$78,messages!A61))))","v":"OK"},"To get the same voltage domain for VSUP and VAUX[1]; auto + frc_ulp_ldo = 0 OR  VAUX_LDO + frc_ulp_ldo = 1",{"$f":"HLOOKUP(B106,constants!$B$124:$E$126,3,FALSE)","v":0},4]
["VAUX[2] connection configuration","to VDD_STS","--","reg_vaux_cfg.vaux2_cfg",{"$f":"HLOOKUP(B107,constants!$B$124:$E$125,2,FALSE)","v":"\"00\""},{"$f":"IF(B101=constants!C60,messages!A78,IF(AND(B107=constants!B124,settings!B96=constants!C60,settings!H42=63),messages!A78,IF(AND(B107=constants!$C$124,$B$96=constants!$B$60,$B$97=$B$108),messages!$A$78,IF(AND($B$96=constants!$C$60,OR(B107=constants!$D$124,B107=constants!$E$124)),messages!$A$78,messages!A62))))","v":"OK"},"To get the same voltage domain for VSUP and VAUX[2]; auto + frc_ulp_ldo = 0 OR  VAUX_LDO + frc_ulp_ldo = 1",{"$f":"HLOOKUP(B107,constants!$B$124:$E$126,3,FALSE)","v":0},16]
["VAUX ldo level v_aux_ldo",2.2000000000000002,"V","reg_ldo_cfg.v_vaux_ldo",{"$f":"VLOOKUP(B108,constants!B129:C136,2,FALSE)","v":"\"101\""},{"$f":"IF(B108>=B15,messages!A59,messages!A78)","v":"OK"},null,{"$f":"VLOOKUP(B108,constants!B129:D136,3,FALSE)","v":5},16]
["Disable VAUX[0] in HRV LOW mode","No","--","reg_pwr_cfg.dis_vaux0_hrv_low",{"$f":"IF(B109=constants!$B$60,\"'1'\",\"'0'\")","v":"'0'"},null,null,{"$f":"IF(B109=constants!$B$60,1,0)","v":0},2]
["Disable VAUX[1] in HRV LOW mode","No","--","reg_pwr_cfg.dis_vaux1_hrv_low",{"$f":"IF(B110=constants!$B$60,\"'1'\",\"'0'\")","v":"'0'"},null,null,{"$f":"IF(B110=constants!$B$60,1,0)","v":0},4]
["Disable VAUX[2] in HRV LOW mode","No","--","reg_pwr_cfg.dis_vaux2_hrv_low",{"$f":"IF(B111=constants!$B$60,\"'1'\",\"'0'\")","v":"'0'"},null,null,{"$f":"IF(B111=constants!$B$60,1,0)","v":0},8]
["VAUX_GND settings: refer to the chapter 4 of \"App Note 85 Supply Outputs\""]
["VAUX_GND[0] enabled at start-up","No","--","reg_pwr_mgt.vaux_gnd0_en",{"$f":"IF(B113=constants!$B$60,\"'1'\",\"'0'\")","v":"'0'"},null,null,{"$f":"IF(B113=constants!$B$60,1,0)","v":0},16]
["VAUX_GND[1] enabled at start-up","No","--","reg_pwr_mgt.vaux_gnd1_en",{"$f":"IF(B114=constants!$B$60,\"'1'\",\"'0'\")","v":"'0'"},null,null,{"$f":"IF(B114=constants!$B$60,1,0)","v":0},32]
["VAUX_GND[2] enabled at start-up","No","--","reg_pwr_mgt.vaux_gnd2_en",{"$f":"IF(B115=constants!$B$60,\"'1'\",\"'0'\")","v":"'0'"},null,null,{"$f":"IF(B115=constants!$B$60,1,0)","v":0},64]
["VAUX_GND[0] connection configuration","whatever STS","--","reg_vaux_gnd_cfg.vaux0_cfg",{"$f":"HLOOKUP($B116,constants!$B$138:$C$139,2,FALSE)","v":"'0'"},null,"VAUX_GND[0] is disabled automatically when VDD_STS > v_apl_max_hi if option  \"Auto connect\" is selected",{"$f":"HLOOKUP($B116,constants!$B$138:$C$140,3,FALSE)","v":0},1]
["VAUX_GND[1] connection configuration","whatever STS","--","reg_vaux_gnd_cfg.vaux1_cfg",{"$f":"HLOOKUP($B117,constants!$B$138:$C$139,2,FALSE)","v":"'0'"},null,"VAUX_GND[1] is disabled automatically when VDD_STS > v_apl_max_hi if option  \"Auto connect\" is selected",{"$f":"HLOOKUP($B117,constants!$B$138:$C$140,3,FALSE)","v":0},2]
["VAUX_GND[2] connection configuration","whatever STS","--","reg_vaux_gnd_cfg.vaux2_cfg",{"$f":"HLOOKUP($B118,constants!$B$138:$C$139,2,FALSE)","v":"'0'"},null,"VAUX_GND[2] is disabled automatically when VDD_STS > v_apl_max_hi if option  \"Auto connect\" is selected",{"$f":"HLOOKUP($B118,constants!$B$138:$C$140,3,FALSE)","v":0},4]
["Disable VAUX_GND[0] in HRV LOW mode","No","--","reg_pwr_cfg.dis_vaux_gnd0_hrv_low",{"$f":"IF(B119=constants!$B$60,\"'1'\",\"'0'\")","v":"'0'"},null,null,{"$f":"IF(B119=constants!$B$60,1,0)","v":0},16]
["Disable VAUX_GND[1] in HRV LOW mode","No","--","reg_pwr_cfg.dis_vaux_gnd1_hrv_low",{"$f":"IF(B120=constants!$B$60,\"'1'\",\"'0'\")","v":"'0'"},null,null,{"$f":"IF(B120=constants!$B$60,1,0)","v":0},32]
["Disable VAUX_GND[2] in HRV LOW mode","No","--","reg_pwr_cfg.dis_vaux_gnd2_hrv_low",{"$f":"IF(B121=constants!$B$60,\"'1'\",\"'0'\")","v":"'0'"},null,null,{"$f":"IF(B121=constants!$B$60,1,0)","v":0},64]
["USB AND SERIAL INTERFACE SETTINGS"]
["USB configuration:"]
["USB LDO always disabled","No","--","reg_pwr_cfg.usb_ldo_frc_dis",{"$f":"IF(B124=constants!$B$60,\"'1'\",\"'0'\")","v":"'0'"},null,"Disable USB LDO in debug mode; VDD_USB does not support VDD_STS even if USB cable is connected",{"$f":"IF(B124=constants!$B$60,1,0)","v":0},128]
["USB forces HRV_LOW Hi-Z","No","--","reg_ext_cfg.usb_frc_hrv_low_hiz",{"$f":"IF(B125=constants!$B$60,\"'1'\",\"'0'\")","v":"'0'"},null,"HRV_LOW pin is Hi-Z when USB detected if Yes",{"$f":"IF(B125=constants!$B$60,1,0)","v":0},8]
["USB forces BAT_LOW Hi-Z","No","--","reg_ext_cfg.usb_frc_bat_low_hiz",{"$f":"IF(B126=constants!$B$60,\"'1'\",\"'0'\")","v":"'0'"},null,"BAT_LOW pin is Hi-Z when USB detected if Yes",{"$f":"IF(B126=constants!$B$60,1,0)","v":0},4]
["USB battery charger current source level",5,"mA","reg_ext_cfg.usb_crt_src_sel",{"$f":"HLOOKUP(B127,constants!B142:E143,2,FALSE)","v":"\"01\""},null,"USB current source disabled if 0mA selected",{"$f":"HLOOKUP(B127,constants!B142:E144,3,FALSE)","v":1},1]
["Serial interface settings:"]
["SDA slope control","Standard","--","reg_ext_cfg.sdi_slopectrl",{"$f":"IF($B129=constants!$B$147,\"'0'\",\"'1'\")","v":"'0'"},null,"Set Hi-speed only if I2C is used in Hi-speed mode and if VSUP is higher than 1.8V",{"$f":"IF($B129=constants!$B$147,0,1)","v":0},128]
["SPI configuration","4 wires","--","reg_spi_i2c_cfg.spi_3w_en",{"$f":"HLOOKUP(B130,constants!B148:C149,2,FALSE)","v":"'0'"},null,"If 3 wires is selected, input & output data share the same IO MOSI_SDA",{"$f":"HLOOKUP(B130,constants!B148:C150,3,FALSE)","v":0},128]
["I2C address",77,"hex","reg_spi_i2c_cfg.i2c_addr",{"$f":"IF(J131>127,constants!B19,IF(J131>15,\"0x\"&DEC2HEX(J131),\"0x0\"&DEC2HEX(J131)))","v":"0x77"},{"$f":"IF(HEX2DEC(B131)>127,messages!A39,messages!A78)","v":"OK"},null,{"$f":"IF(E131=constants!B19,0,HEX2DEC(settings!B131))","v":119},1,{"$f":"IF(C131=constants!$B$152,HEX2DEC(B131),IF(C131=constants!$C$152,HEX2DEC(DEC2HEX(B131)),BIN2DEC(B131)))","v":119}]
["FREE EEPROM AREA"]
["Free EEPROM area settings:"]
[126,"FF","hex","--",{"$f":"IF(J134>15,\"0x\"&DEC2HEX(J134),\"0x0\"&DEC2HEX(J134))","v":"0xFF"},null,"EEPROM area free for user",null,null,{"$f":"IF(C134=constants!$B$152,HEX2DEC(B134),IF(C134=constants!$C$152,HEX2DEC(DEC2HEX(B134)),BIN2DEC(B134)))","v":255}]
[{"$f":"A134+101","v":227},"FF","hex","--",{"$f":"IF(J135>15,\"0x\"&DEC2HEX(J135),\"0x0\"&DEC2HEX(J135))","v":"0xFF"},null,"EEPROM area free for user",null,null,{"$f":"IF(C135=constants!$B$152,HEX2DEC(B135),IF(C135=constants!$C$152,HEX2DEC(DEC2HEX(B135)),BIN2DEC(B135)))","v":255}]
[{"$f":"A135+101","v":328},"FF","hex","--","0xFF",null,"EEPROM area free for user",null,null,{"$f":"IF(C136=constants!$B$152,HEX2DEC(B136),IF(C136=constants!$C$152,HEX2DEC(DEC2HEX(B136)),BIN2DEC(B136)))","v":255}]
[429,"FF","hex","--","0xFF",null,"EEPROM area free for user",null,null,{"$f":"IF(C137=constants!$B$152,HEX2DEC(B137),IF(C137=constants!$C$152,HEX2DEC(DEC2HEX(B137)),BIN2DEC(B137)))","v":255}]
[530,"FF","hex","--","0xFF",null,"EEPROM area free for user",null,null,{"$f":"IF(C138=constants!$B$152,HEX2DEC(B138),IF(C138=constants!$C$152,HEX2DEC(DEC2HEX(B138)),BIN2DEC(B138)))","v":255}]
[631,"FF","hex","--","0xFF",null,"EEPROM area free for user",null,null,{"$f":"IF(C139=constants!$B$152,HEX2DEC(B139),IF(C139=constants!$C$152,HEX2DEC(DEC2HEX(B139)),BIN2DEC(B139)))","v":255}]
[732,"FF","hex","--","0xFF",null,"EEPROM area free for user",null,null,{"$f":"IF(C140=constants!$B$152,HEX2DEC(B140),IF(C140=constants!$C$152,HEX2DEC(DEC2HEX(B140)),BIN2DEC(B140)))","v":255}]
[833,"FF","hex","--","0xFF",null,"EEPROM area free for user",null,null,{"$f":"IF(C141=constants!$B$152,HEX2DEC(B141),IF(C141=constants!$C$152,HEX2DEC(DEC2HEX(B141)),BIN2DEC(B141)))","v":255}]
[934,"FF","hex","--","0xFF",null,"EEPROM area free for user",null,null,{"$f":"IF(C142=constants!$B$152,HEX2DEC(B142),IF(C142=constants!$C$152,HEX2DEC(DEC2HEX(B142)),BIN2DEC(B142)))","v":255}]
[1035,"FF","hex","--","0xFF",null,"EEPROM area free for user",null,null,{"$f":"IF(C143=constants!$B$152,HEX2DEC(B143),IF(C143=constants!$C$152,HEX2DEC(DEC2HEX(B143)),BIN2DEC(B143)))","v":255}]
[1136,"FF","hex","--","0xFF",null,"EEPROM area free for user",null,null,{"$f":"IF(C144=constants!$B$152,HEX2DEC(B144),IF(C144=constants!$C$152,HEX2DEC(DEC2HEX(B144)),BIN2DEC(B144)))","v":255}]
[1237,"FF","hex","--","0xFF",null,"EEPROM area free for user",null,null,{"$f":"IF(C145=constants!$B$152,HEX2DEC(B145),IF(C145=constants!$C$152,HEX2DEC(DEC2HEX(B145)),BIN2DEC(B145)))","v":255}]
[1338,"FF","hex","--","0xFF",null,"EEPROM area free for user",null,null,{"$f":"IF(C146=constants!$B$152,HEX2DEC(B146),IF(C146=constants!$C$152,HEX2DEC(DEC2HEX(B146)),BIN2DEC(B146)))","v":255}]
[1439,"FF","hex","--","0xFF",null,"EEPROM area free for user",null,null,{"$f":"IF(C147=constants!$B$152,HEX2DEC(B147),IF(C147=constants!$C$152,HEX2DEC(DEC2HEX(B147)),BIN2DEC(B147)))","v":255}]
[1540,"FF","hex","--","0xFF",null,"EEPROM area free for user",null,null,{"$f":"IF(C148=constants!$B$152,HEX2DEC(B148),IF(C148=constants!$C$152,HEX2DEC(DEC2HEX(B148)),BIN2DEC(B148)))","v":255}]
[1641,"FF","hex","--","0xFF",null,"EEPROM area free for user",null,null,{"$f":"IF(C149=constants!$B$152,HEX2DEC(B149),IF(C149=constants!$C$152,HEX2DEC(DEC2HEX(B149)),BIN2DEC(B149)))","v":255}]
[1742,"FF","hex","--","0xFF",null,"EEPROM area free for user",null,null,{"$f":"IF(C150=constants!$B$152,HEX2DEC(B150),IF(C150=constants!$C$152,HEX2DEC(DEC2HEX(B150)),BIN2DEC(B150)))","v":255}]
[1843,"FF","hex","--","0xFF",null,"EEPROM area free for user",null,null,{"$f":"IF(C151=constants!$B$152,HEX2DEC(B151),IF(C151=constants!$C$152,HEX2DEC(DEC2HEX(B151)),BIN2DEC(B151)))","v":255}]
[1944,"FF","hex","--","0xFF",null,"EEPROM area free for user",null,null,{"$f":"IF(C152=constants!$B$152,HEX2DEC(B152),IF(C152=constants!$C$152,HEX2DEC(DEC2HEX(B152)),BIN2DEC(B152)))","v":255}]
[2045,"FF","hex","--","0xFF",null,"EEPROM area free for user",null,null,{"$f":"IF(C153=constants!$B$152,HEX2DEC(B153),IF(C153=constants!$C$152,HEX2DEC(DEC2HEX(B153)),BIN2DEC(B153)))","v":255}]
[2146,"FF","hex","--","0xFF",null,"EEPROM area free for user",null,null,{"$f":"IF(C154=constants!$B$152,HEX2DEC(B154),IF(C154=constants!$C$152,HEX2DEC(DEC2HEX(B154)),BIN2DEC(B154)))","v":255}]
[2247,"FF","hex","--","0xFF",null,"EEPROM area free for user",null,null,{"$f":"IF(C155=constants!$B$152,HEX2DEC(B155),IF(C155=constants!$C$152,HEX2DEC(DEC2HEX(B155)),BIN2DEC(B155)))","v":255}]
[2348,"FF","hex","--","0xFF",null,"EEPROM area free for user",null,null,{"$f":"IF(C156=constants!$B$152,HEX2DEC(B156),IF(C156=constants!$C$152,HEX2DEC(DEC2HEX(B156)),BIN2DEC(B156)))","v":255}]
[2449,"FF","hex","--","0xFF",null,"EEPROM area free for user",null,null,{"$f":"IF(C157=constants!$B$152,HEX2DEC(B157),IF(C157=constants!$C$152,HEX2DEC(DEC2HEX(B157)),BIN2DEC(B157)))","v":255}]
[2550,"FF","hex","--","0xFF",null,"EEPROM area free for user",null,null,{"$f":"IF(C158=constants!$B$152,HEX2DEC(B158),IF(C158=constants!$C$152,HEX2DEC(DEC2HEX(B158)),BIN2DEC(B158)))","v":255}]
[2651,"FF","hex","--","0xFF",null,"EEPROM area free for user",null,null,{"$f":"IF(C159=constants!$B$152,HEX2DEC(B159),IF(C159=constants!$C$152,HEX2DEC(DEC2HEX(B159)),BIN2DEC(B159)))","v":255}]
[2752,"FF","hex","--","0xFF",null,"EEPROM area free for user",null,null,{"$f":"IF(C160=constants!$B$152,HEX2DEC(B160),IF(C160=constants!$C$152,HEX2DEC(DEC2HEX(B160)),BIN2DEC(B160)))","v":255}]

{"sheet":"register map","index":1,"n_rows":67,"n_cols":16,"rows_kept":67,"cut":false,"hidden":false,"merged":[[56,8,56,10],[57,8,57,10],[63,8,63,10],[64,8,64,10],[65,8,65,10],[58,8,58,10],[59,8,59,10],[60,8,60,10],[61,8,61,10],[62,8,62,10],[51,8,51,10],[52,8,52,10],[53,8,53,10],[54,8,54,10],[55,8,55,10],[49,8,49,10],[50,8,50,10],[31,8,31,10],[32,8,32,10],[25,9,25,10],[26,8,26,10],[40,8,40,10],[46,8,46,10],[47,8,47,10],[41,8,41,10],[42,8,42,10],[43,8,43,10],[44,8,44,10],[48,8,48,10],[29,8,29,10],[30,8,30,10],[45,8,45,10],[16,9,16,10],[37,8,37,10],[38,8,38,10],[39,8,39,10],[33,8,33,10],[34,8,34,10],[35,8,35,10],[36,8,36,10],[28,8,28,10],[21,8,21,10],[24,8,24,10],[23,8,23,10],[22,8,22,10],[27,8,27,10],[20,8,20,10],[11,8,11,10],[10,8,10,10],[6,9,6,10],[5,8,5,10],[8,8,8,9],[13,8,13,10],[12,8,12,10],[14,8,14,10],[15,8,15,10],[17,8,19,10],[4,8,4,10],[3,8,3,10],[9,8,9,10],[7,8,7,10],[0,0,0,6],[1,8,1,10],[2,8,2,10],[0,8,0,9]]}
["EM8502 register map",null,null,null,null,null,null,null,{"$f":"IF(L10<=L11,messages!A43,IF(L15<=L16,messages!A44,IF(OR(L12<=L14,L13<=L14),messages!A45,IF(OR(L12>=L16,L13>=L16),messages!A46,IF(OR(L12>=L11,L13>=L11),messages!A47,IF(MID(H22,3,2)=\"00\",messages!A48,IF(COUNTIF(F3:F28,\"\")<>26,messages!A64,settings!E4)))))))","v":"OK"}]
["RegName in EEPROM area","Address","Related register","Calc Value [hex]","DEC","Overwrite\n[hex]","Effective\n[hex]",null,"Physical representation"]
["eeprom0","0x40","reg_t_hrv_period",{"$f":"settings!E31","v":"0x02"},null,null,{"$f":"IF(F3=\"\",D3,\"0x\"&DEC2HEX(HEX2DEC(F3),2))","v":"0x02"},{"$f":"TEXT(HEX2BIN(MID(G3,3,2)),\"00000000\")","v":"00000010"},{"$f":"VLOOKUP(VALUE(MID(H3,6,3)),constants!A51:C58,3,FALSE)&\" ms\"","v":"1024 ms"}]
["eeprom1","0x41","reg_t_hrv_meas",{"$f":"settings!E30","v":"0x02"},null,null,{"$f":"IF(F4=\"\",D4,\"0x\"&DEC2HEX(HEX2DEC(F4),2))","v":"0x02"},{"$f":"TEXT(HEX2BIN(MID(G4,3,2)),\"00000000\")","v":"00000010"},{"$f":"VLOOKUP(VALUE(MID(H4,6,3)),constants!A51:B58,2,FALSE)&\" ms\"","v":"64 ms"}]
["eeprom2","0x42","reg_t_sts_period",{"$f":"settings!E62","v":"0x00"},null,null,"0x00","00000000",{"$f":"VLOOKUP(BIN2DEC(MID(H5,6,3)),constants!A78:B85,2,FALSE)&\" ms\"","v":"1 ms"}]
["eeprom3","0x43","reg_t_lts_period",{"$f":"settings!E83","v":"0x02"},null,null,"0x02","00000010",{"$f":"VLOOKUP(BIN2DEC(MID(H6,6,3)),constants!A88:B95,2,FALSE)&\" ms\"","v":"16 ms"}]
["eeprom4","0x44","reg_v_hrv_cfg",{"$f":"IF(E7>15,\"0x\"&DEC2HEX(E7),\"0x0\"&DEC2HEX(E7))","v":"0x01"},{"$f":"(PRODUCT(settings!H14:I14)+PRODUCT(settings!H18:I18))","v":1},null,"0x01","00000001",{"$f":"IF(MID(H7,2,1)=\"1\",constants!B186,constants!B185)","v":"HRV check by Ishort-cut"},{"$f":"\"v_hrv_min: \"&TEXT((BIN2DEC(MID(H7,3,6))+1)*constants!C64,\"0.000\")&\" V (TYP)\"","v":"v_hrv_min: 0.146 V (TYP)"}]
["eeprom5","0x45","reg_hrv_check_lvl",{"$f":"settings!E24","v":"0x02"},null,null,"0x02","00000010",{"$f":"(BIN2DEC(MID(H8,5,4))+1)&\" µA\"","v":"3 µA"}]
["eeprom6","0x46","reg_lts_cfg",{"$f":"IF(E9>15,\"0x\"&DEC2HEX(E9),\"0x0\"&DEC2HEX(E9))","v":"0x00"},{"$f":"PRODUCT(settings!H36:I36)+PRODUCT(settings!H37:I37)+PRODUCT(settings!H38:I38)","v":0},null,"0x00","00000000",{"$f":"IF(MID(H9,7,1)=\"0\",constants!C190,IF(MID(H9,6,1)=\"0\",constants!C191&\" & \"&constants!B190,constants!C191&\" & \"&constants!B191))","v":"rechargeable battery"},null,{"$f":"IF(MID(H9,8,1)=\"0\",constants!D190,constants!D191)","v":"battery protection on"}]
["eeprom7","0x47","reg_v_bat_max_hi",{"$f":"settings!E41","v":"0x24"},null,null,"0x24","00100100",{"$f":"TEXT((BIN2DEC(MID(H10,3,6))+1)*constants!$C$64,\"0.000\")&\" V (TYP)\"","v":"2.701 V (TYP)"},null,null,{"$f":"BIN2DEC(H10)","v":36}]
["eeprom8","0x48","reg_v_bat_max_lo",{"$f":"settings!E80","v":"0x23"},null,null,"0x23","00100011",{"$f":"TEXT((BIN2DEC(MID(H11,3,6))+1)*constants!$C$64,\"0.000\")&\" V (TYP)\"","v":"2.628 V (TYP)"},null,null,35]
["eeprom9","0x49","reg_v_bat_min_hi_dis",{"$f":"settings!E66","v":"0x1A"},null,null,"0x1A","00011010",{"$f":"TEXT((BIN2DEC(MID(H12,3,6))+1)*constants!$C$64,\"0.000\")&\" V (TYP)\"","v":"1.971 V (TYP)"},null,null,26]
["eeprom10","0x4A","reg_v_bat_min_hi_con",{"$f":"settings!E71","v":"0x1A"},null,null,"0x1A","00011010",{"$f":"TEXT((BIN2DEC(MID(H13,3,6))+1)*constants!$C$64,\"0.000\")&\" V (TYP)\"","v":"1.971 V (TYP)"},null,null,26]
["eeprom11","0x4B","reg_v_bat_min_lo",{"$f":"settings!E43","v":"0x18"},null,null,"0x18","00011000",{"$f":"TEXT((BIN2DEC(MID(H14,3,6))+1)*constants!$C$64,\"0.000\")&\" V (TYP)\"","v":"1.825 V (TYP)"},null,null,24]
["eeprom12","0x4C","reg_v_apl_max_hi",{"$f":"settings!E42","v":"0x3F"},null,null,"0x3F","00111111",{"$f":"TEXT((BIN2DEC(MID(H15,3,6))+1)*constants!$C$64,\"0.000\")&\" V (TYP)\"","v":"4.672 V (TYP)"},null,null,63]
["eeprom13","0x4D","reg_v_apl_max_lo",{"$f":"settings!E77","v":"0x3E"},null,null,"0x3E","00111110",{"$f":"TEXT((BIN2DEC(MID(H16,3,6))+1)*constants!$C$64,\"0.000\")&\" V (TYP)\"","v":"4.599 V (TYP)"},null,null,62]
["eeprom14","0x4E","reg_ldo_cfg",{"$f":"IF(E17>15,\"0x\"&DEC2HEX(E17),\"0x0\"&DEC2HEX(E17))","v":"0xD7"},{"$f":"PRODUCT(settings!H87:I87)+PRODUCT(settings!H96:I96)+PRODUCT(settings!H97:I97)+PRODUCT(settings!H108:I108)","v":215},null,"0xD7","11010111",{"$f":"\"VAUX LDO: \"&VLOOKUP(VALUE(MID($H$17,2,3)),constants!$A$129:$B$136,2,FALSE)&\" V\"","v":"VAUX LDO: 2.2 V"},{"$f":"\"ULP LDO: \"&VLOOKUP(VALUE(MID($H$17,6,3)),constants!$A$114:$B$121,2,FALSE)&\" V\"","v":"ULP LDO: 2.6 V"}]
["eeprom15","0x4F","reg_pwr_cfg",{"$f":"IF(E18>15,\"0x\"&DEC2HEX(E18),\"0x0\"&DEC2HEX(E18))","v":"0x00"},{"$f":"PRODUCT(settings!H89:I89)+PRODUCT(settings!H109:I109)+PRODUCT(settings!H110:I110)+PRODUCT(settings!H111:I111)+PRODUCT(settings!H119:I119)+PRODUCT(settings!H120:I120)+PRODUCT(settings!H121:I121)+PRODUCT(settings!H124:I124)","v":0},null,"0x00","00000000"]
["eeprom16","0x50","reg_vaux_cfg",{"$f":"IF(E19>15,\"0x\"&DEC2HEX(E19),\"0x0\"&DEC2HEX(E19))","v":"0x00"},{"$f":"PRODUCT(settings!H105:I105)+PRODUCT(settings!H106:I106)+PRODUCT(settings!H107:I107)","v":0},null,"0x00","00000000"]
["eeprom17","0x51","reg_vaux_gnd_cfg",{"$f":"IF(E20>15,\"0x\"&DEC2HEX(E20),\"0x0\"&DEC2HEX(E20))","v":"0x00"},{"$f":"PRODUCT(settings!H116:I116)+PRODUCT(settings!H117:I117)+PRODUCT(settings!H118:I118)","v":0},null,"0x00","00000000"]
["eeprom18","0x52","reg_mppt_ratio",{"$f":"settings!E11","v":"0x06"},null,null,"0x06","00000110",{"$f":"TEXT(HLOOKUP(VALUE(MID(H21,5,4)),constants!B5:Q6,2,FALSE),\"0%\")","v":"80%"}]
["eeprom19","0x53","reg_ext_cfg",{"$f":"IF(E22>15,\"0x\"&DEC2HEX(E22),\"0x0\"&DEC2HEX(E22))","v":"0x51"},{"$f":"PRODUCT(settings!H94:I94)+PRODUCT(settings!H95:I95)+PRODUCT(settings!H125:I125)+PRODUCT(settings!H126:I126)+PRODUCT(settings!H127:I127)+PRODUCT(settings!H129:I129)","v":81},null,"0x51","01010001",{"$f":"VLOOKUP(MID($H22,N$67+2,2),constants!A172:B175,2,FALSE)","v":"USB crt source 5 mA"}]
["eeprom20","0x54","reg_t_sleep_vsup_lo",{"$f":"settings!E93","v":"0xE8"},null,null,"0xE8",null,"Sleep delay"]
["eeprom21","0x55","reg_t_sleep_vsup_mid",{"$f":"settings!E92","v":"0x03"},null,null,"0x03",null,"h:min:sec:ms"]
["eeprom22","0x56","reg_t_sleep_vsup_hi",{"$f":"settings!E91","v":"0x00"},null,null,"0x00",null,{"$f":"L25&\":\"&M25&\":\"&N25&\":\"&O25","v":"0:0:1:0"},null,null,{"$f":"TRUNC((HEX2DEC(MID(G25,3,2))*256*256+HEX2DEC(MID(G24,3,2))*256+HEX2DEC(MID(G23,3,2)))/(1000*60*60),0)","v":0},{"$f":"TRUNC((HEX2DEC(MID(G25,3,2))*256*256+HEX2DEC(MID(G24,3,2))*256+HEX2DEC(MID(G23,3,2)))/(1000*60)-L25*60,0)","v":0},{"$f":"TRUNC((HEX2DEC(MID(G25,3,2))*256*256+HEX2DEC(MID(G24,3,2))*256+HEX2DEC(MID(G23,3,2)))/(1000)-L25*3600-M25*60,0)","v":1},{"$f":"(HEX2DEC(MID(G25,3,2))*256*256+HEX2DEC(MID(G24,3,2))*256+HEX2DEC(MID(G23,3,2)))-N25*1000-M25*1000*60-L25*1000*60*60","v":0}]
["eeprom23","0x57","reg_t_hrv_low_cfg",{"$f":"IF(E26>15,\"0x\"&DEC2HEX(E26),\"0x0\"&DEC2HEX(E26))","v":"0x22"},{"$f":"PRODUCT(settings!H84:I84)+PRODUCT(settings!H33:I33)","v":34},null,"0x22","00100010",{"$f":"\"t_hrv_low_period: \"&VLOOKUP(VALUE(MID(H26,2,3)),constants!A51:C58,3,FALSE)&\" ms\"","v":"t_hrv_low_period: 1024 ms"},{"$f":"\"t_lts_hrv_low_period: \"&VLOOKUP(BIN2DEC(MID(H26,6,3)),constants!A98:B105,2,FALSE)&\" ms\"","v":"t_lts_hrv_low_period: 32 ms"}]
["eeprom24","0x58","reg_spi_i2c_cfg",{"$f":"IF(E27>15,\"0x\"&DEC2HEX(E27),\"0x0\"&DEC2HEX(E27))","v":"0x77"},{"$f":"PRODUCT(settings!H130:I130)+PRODUCT(settings!H131:I131)","v":119},null,"0x77","01110111",{"$f":"\"I2C address: \"&BIN2HEX(MID(H27,2,7))","v":"I2C address: 77"}]
["eeprom25","0x59","reg_pwr_mgt",{"$f":"IF(E28>15,\"0x\"&DEC2HEX(E28),\"0x0\"&DEC2HEX(E28))","v":"0x01"},{"$f":"PRODUCT(settings!H88:I88)+PRODUCT(settings!H102:I102)+PRODUCT(settings!H103:I103)+PRODUCT(settings!H104:I104)+PRODUCT(settings!H113:I113)+PRODUCT(settings!H114:I114)+PRODUCT(settings!H115:I115)","v":1},null,"0x01","00000001"]
["eeprom26","0x5A",1,{"$f":"settings!E134","v":"0xFF"},null,null,"0xFF"]
["eeprom27","0x5B",{"$f":"C29+1","v":2},{"$f":"settings!E135","v":"0xFF"},null,null,"0xFF"]
["eeprom28","0x5C",{"$f":"C30+1","v":3},{"$f":"settings!E136","v":"0xFF"},null,null,"0xFF"]
["eeprom29","0x5D",4,{"$f":"settings!E137","v":"0xFF"},null,null,"0xFF"]
["eeprom30","0x5E",5,{"$f":"settings!E138","v":"0xFF"},null,null,"0xFF"]
["eeprom31","0x5F",6,{"$f":"settings!E139","v":"0xFF"},null,null,"0xFF"]
["eeprom32","0x60",7,{"$f":"settings!E140","v":"0xFF"},null,null,"0xFF"]
["eeprom33","0x61",8,{"$f":"settings!E141","v":"0xFF"},null,null,"0xFF"]
["eeprom34","0x62",9,{"$f":"settings!E142","v":"0xFF"},null,null,"0xFF"]
["eeprom35","0x63",10,{"$f":"settings!E143","v":"0xFF"},null,null,"0xFF"]
["eeprom36","0x64",11,{"$f":"settings!E144","v":"0xFF"},null,null,"0xFF"]
["eeprom37","0x65",12,{"$f":"settings!E145","v":"0xFF"},null,null,"0xFF"]
["eeprom38","0x66",13,{"$f":"settings!E146","v":"0xFF"},null,null,"0xFF"]
["eeprom39","0x67",14,{"$f":"settings!E147","v":"0xFF"},null,null,"0xFF"]
["eeprom40","0x68",15,{"$f":"settings!E148","v":"0xFF"},null,null,"0xFF"]
["eeprom41","0x69",16,{"$f":"settings!E149","v":"0xFF"},null,null,"0xFF"]
["eeprom42","0x6A",17,{"$f":"settings!E150","v":"0xFF"},null,null,"0xFF"]
["eeprom43","0x6B",18,{"$f":"settings!E151","v":"0xFF"},null,null,"0xFF"]
["eeprom44","0x6C",19,{"$f":"settings!E152","v":"0xFF"},null,null,"0xFF"]
["eeprom45","0x6D",20,{"$f":"settings!E153","v":"0xFF"},null,null,"0xFF"]
["eeprom46","0x6E",21,{"$f":"settings!E154","v":"0xFF"},null,null,"0xFF"]
["eeprom47","0x6F",22,{"$f":"settings!E155","v":"0xFF"},null,null,"0xFF"]
["eeprom48","0x70",23,{"$f":"settings!E156","v":"0xFF"},null,null,"0xFF"]
["eeprom49","0x71",24,{"$f":"settings!E157","v":"0xFF"},null,null,"0xFF"]
["eeprom50","0x72",25,{"$f":"settings!E158","v":"0xFF"},null,null,"0xFF"]
["eeprom51","0x73",26,{"$f":"settings!E159","v":"0xFF"},null,null,"0xFF"]
["eeprom52","0x74",27,{"$f":"settings!E160","v":"0xFF"},null,null,"0xFF"]
["eeprom53","0x75","reserved","X",null,null,"X"]
["eeprom54","0x76","reserved","X",null,null,"X"]
["eeprom55","0x77","reserved","X",null,null,"X"]
["eeprom56","0x78","reserved","X",null,null,"X"]
["eeprom57","0x79","reserved","X",null,null,"X"]
["eeprom58","0x7A","reserved","X",null,null,"X"]
["eeprom59","0x7B","reserved","X",null,null,"X"]
["eeprom60","0x7C","reserved","X",null,null,"X"]
["eeprom61","0x7D","reserved","X",null,null,"X"]
["eeprom62","0x7E","reserved","X",null,null,"X"]
["eeprom63","0x7F","reserved","X",null,null,"X"]
[null,null,null,null,null,null,null,null,0,1,2,3,4,5,6,7]

{"sheet":"constants","index":3,"n_rows":207,"n_cols":17,"rows_kept":207,"cut":false,"hidden":true,"merged":[[11,1,11,3],[23,4,23,6],[47,0,49,0],[48,1,49,1],[47,3,49,3],[47,4,49,4],[47,5,49,5],[23,1,23,3]]}
["Harvester type","Solar cell","TEG"]
["MPPT ratio",{"$f":"2/4","v":0.5},{"$f":"3/5","v":0.6},{"$f":"4/6","v":0.66666666666666663},{"$f":"5/7","v":0.7142857142857143},{"$f":"6/8","v":0.75},{"$f":"7/9","v":0.77777777777777779},{"$f":"8/10","v":0.8},{"$f":"9/11","v":0.81818181818181823},{"$f":"10/12","v":0.83333333333333337},{"$f":"11/13","v":0.84615384615384615},{"$f":"12/14","v":0.8571428571428571},{"$f":"13/15","v":0.8666666666666667},{"$f":"14/16","v":0.875},{"$f":"14/16","v":0.875},{"$f":"14/16","v":0.875},{"$f":"14/16","v":0.875}]
["reg_mppt_ratio [dec]",0,{"$f":"B3+1","v":1},{"$f":"C3+1","v":2},3,4,5,6,7,8,9,10,11,12,13,14,15]
["reg_mppt_ratio [hex]",{"$f":"\"0x0\"&DEC2HEX(B3)","v":"0x00"},{"$f":"\"0x0\"&DEC2HEX(C3)","v":"0x01"},"0x02","0x03","0x04","0x05","0x06","0x07","0x08","0x09","0x0A","0x0B","0x0C",{"$f":"\"0x0\"&DEC2HEX(O3)","v":"0x0D"},"0x0E","0x0F"]
[null,0,1,10,11,100,101,110,111,1000,1001,1010,1011,1100,1101,1110,1111]
[null,0.5,0.6,0.66666666666666663,0.7142857142857143,0.75,0.77777777777777779,0.8,0.81818181818181823,0.83333333333333337,0.84615384615384615,0.8571428571428571,0.8666666666666667,0.875,0.875,0.875,0.875]
[]
["HRV check method","Open voltage","Short-cut current"]
["reg_v_hrv_cfg.hrv_check_vld","'1'","'0'"]
[null,1,0]
[]
[null,"Maximum TEG internal resistivity"]
[null,"Vout range","Vout range","Vout range"]
["Vov min","1.5V to 2V","2V to 3V","3V to 3.6V","Vov min","v_hrv_min","v_hrv_min"]
[216,830,410,80,{"$f":"A15","v":216},"0x02",2]
[288,2980,1490,290,{"$f":"A16","v":288},"0x03",3]
[359,7770,3880,1160,{"$f":"A17","v":359},"0x04",4]
[431,16780,8390,3350,{"$f":"A18","v":431},"0x05",5]
[null,"Out of range","Out of range","Out of range"]
[]
[null,"MIN","TYP","MAX"]
["VDD_HRV open",1.8,3,4.2]
[]
[null,"Ihrv_lim",null,null,"reg_hrv_check_lvl"]
[null,"Vout range","Vout range","Vout range","Vout range","Vout range","Vout range"]
[null,"1.5V to 2V","2V to 3V","3V to 3.6V","1.5V to 2V","2V to 3V","3V to 3.6V"]
[0.2,11,"Out of range","Out of range","0x0A","Out of range","Out of range"]
[0.3,4,8,15,"0x03","0x07","0x0E"]
[0.4,3,6,9,"0x02","0x05","0x08"]
[0.5,3,3,5,"0x02","0x02","0x04"]
[0.6,2,2,4,"0x01","0x01","0x03"]
[0.7,2,2,4,"0x01","0x01","0x03"]
[0.8,2,2,3,"0x01","0x01","0x02"]
[0.9,2,2,3,"0x01","0x01","0x02"]
[1,2,2,3,"0x01","0x01","0x02"]
[1.1000000000000001,1,1,2,"0x00","0x00","0x01"]
[1.2,1,1,2,"0x00","0x00","0x01"]
[1.3,1,1,2,"0x00","0x00","0x01"]
[1.4,1,1,2,"0x00","0x00","0x01"]
[1.45,1,1,2,"0x00","0x00","0x01"]
[]
["Ihrv_lim [uA]",1,{"$f":"B42+1","v":2},{"$f":"C42+1","v":3},4,5,6,7,8,9,10,11,12,13,14,15,16]
["reg_hrv_check_lvl",{"$f":"\"0x0\"&DEC2HEX(B42-1)","v":"0x00"},{"$f":"\"0x0\"&DEC2HEX(C42-1)","v":"0x01"},"0x02","0x03","0x04","0x05","0x06","0x07","0x08","0x09","0x0A","0x0B","0x0C","0x0D","0x0E","0x0F"]
[]
[null,"MIN","TYP","MAX"]
["Chrv",2.2000000000000002,4.7,10,"uF"]
[]
["Register value","Thrv_meas","Thrv_period","Register value","Register value","Register value"]
[null,"(register : t_hrv_meas)","(register : t_hrv_period ; HRV_LOW = 0)"]
[null,null,"(register : t_hrv_low_period ; HRV_LOW = 1)"]
[0,16,256,"0x00","\"000\"",0]
[1,{"$f":"B51*2","v":32},512,"0x01","\"001\"",{"$f":"F51+1","v":1}]
[10,64,1024,"0x02","\"010\"",{"$f":"F52+1","v":2}]
[11,128,2048,"0x03","\"011\"",3]
[100,256,4096,"0x04","\"100\"",4]
[101,512,8192,"0x05","\"101\"",5]
[110,1024,16384,"0x06","\"110\"",6]
[111,2048,32768,"0x07","\"111\"",7]
[]
["Binary selection","Yes","No"]
[]
["VLD constants"]
[null,"MIN","TYP","MAX"]
["Vlvl",{"$f":"C64*0.95","v":6.9349999999999995E-2},7.2999999999999995E-2,{"$f":"C64*1.05","v":7.6649999999999996E-2},"V"]
[]
["Supervisory constants"]
["v_bat_max_hi",null,null,4.2,"V"]
["v_bat_min_lo",1.47,null,null,"V"]
[]
[null,"MIN","TYP","MAX"]
["Csup",1,null,null,"uF"]
["Caux0",1,null,null,"uF"]
["Caux1",1,null,null,"uF"]
["Caux2",1,null,null,"uF"]
["Csts",10,null,null,"uF"]
[]
["STS Supervisory timings"]
[0,1,"ms",0,0]
[1,2,"ms",{"$f":"D78+1","v":1},{"$f":"E78+1","v":1}]
[2,8,"ms",{"$f":"D79+1","v":2},2]
[3,16,"ms",3,3]
[4,32,"ms",4,4]
[5,64,"ms",5,5]
[6,128,"ms",6,6]
[7,256,"ms",7,7]
[]
["LTS Supervisory timings"]
[0,1,"ms",0,0]
[1,4,"ms",{"$f":"D88+1","v":1},{"$f":"E88+1","v":1}]
[2,16,"ms",{"$f":"D89+1","v":2},2]
[3,64,"ms",3,3]
[4,256,"ms",4,4]
[5,1024,"ms",5,5]
[6,4096,"ms",6,6]
[7,16384,"ms",7,7]
[]
["LTS Supervisory timings"]
[0,2,"ms","\"000\"",0]
[1,8,"ms","\"001\"",{"$f":"E98+1","v":1}]
[2,32,"ms","\"010\"",{"$f":"E99+1","v":2}]
[3,128,"ms","\"011\"",3]
[4,512,"ms","\"100\"",4]
[5,2048,"ms","\"101\"",5]
[6,8192,"ms","\"110\"",6]
[7,32768,"ms","\"111\"",7]
[]
["Tsleep unit","ms","s","min","h"]
[]
["Wake-up edge selection","no edge","falling edge","rising edge","both edges"]
[null,"\"00\"","\"01\"","\"10\"","\"11\""]
[null,0,1,2,3]
[]
["reg_ldo_cfg.v_ulp_ldo[2:0]","v_ulp_ldo [V]","reg_ldo_cfg.v_ulp_ldo[2:0]","reg_ldo_cfg.v_ulp_ldo[2:0]"]
[0,1.2,"\"000\"",0]
[1,1.55,"\"001\"",{"$f":"D114+1","v":1}]
[10,1.65,"\"010\"",{"$f":"D115+1","v":2}]
[11,1.8,"\"011\"",3]
[100,2,"\"100\"",4]
[101,2.2000000000000002,"\"101\"",5]
[110,2.4,"\"110\"",6]
[111,2.6,"\"111\"",7]
[]
[]
["VAUX[i] connection configuration","to VDD_STS","to VAUX LDO","Auto, float if off","Auto, grounded if off"]
[null,"\"00\"","\"01\"","\"10\"","\"11\""]
[null,0,1,2,3]
[]
["reg_ldo_cfg.v_aux_ldo[2:0]","v_aux_ldo [V]","reg_aux_cfg.v_ulp_ldo[2:0]","reg_ldo_cfg.v_aux_ldo[2:0]"]
[0,1.2,"\"000\"",0]
[1,1.55,"\"001\"",{"$f":"D129+1","v":1}]
[10,1.65,"\"010\"",{"$f":"D130+1","v":2}]
[11,1.8,"\"011\"",3]
[100,2,"\"100\"",4]
[101,2.2000000000000002,"\"101\"",5]
[110,2.4,"\"110\"",6]
[111,2.6,"\"111\"",7]
[]
["VAUX_GND[i] connection configuration","whatever STS","Auto connect"]
[null,"'0'","'1'"]
[null,0,1]
[]
["USB current",0,5,10,20]
[null,"\"00\"","\"01\"","\"10\"","\"11\""]
[null,0,1,2,3]
[]
[]
["Serial interface settings","Standard","Hi-speed"]
["SPI config","4 wires","3 wires"]
[null,"'0'","'1'"]
[null,0,1]
[]
["Data base","hex","dec","bin"]
[]
["vcs_hi",1.3]
[]
[null,"usb_ldo_frc_dis","dis_vaux_gnd2_hrv_low","dis_vaux_gnd1_hrv_low","dis_vaux_gnd0_hrv_low","dis_vaux2_hrv_low","dis_vaux1_hrv_low","dis_vaux0_hrv_low","dis_vsup_hrv_low"]
["0","USB LDO on","VAUX_GND2 on in HRV_LOW","VAUX_GND1 on in HRV_LOW","VAUX_GND0 on in HRV_LOW","VAUX2 on in HRV_LOW","VAUX1 on in HRV_LOW","VAUX0 on in HRV_LOW","VSUP on in HRV_LOW"]
["1","USB LDO off","VAUX_GND2 off in HRV_LOW","VAUX_GND1 off in HRV_LOW","VAUX_GND0 off in HRV_LOW","VAUX2 off in HRV_LOW","VAUX1 off in HRV_LOW","VAUX0 off in HRV_LOW","VSUP off in HRV_LOW"]
[]
[]
[null,"sdi_slopectrl","wake_up_deb_en",null,null,"usb_frc_hrv_low_hiz","usb_frc_bat_low_hiz"]
["0","I2C std speed","wake-up debouncer off",null,null,"HRV_LOW hi-z if USB off","BAT_LOW hi-z if USB off"]
["1","I2C hi-speed","wake-up debouncer on",null,null,"HRV_LOW hi-z if USB on","BAT_LOW hi-z if USB on"]
[]
[null,"wake_up_edge_cfg"]
["00","wake-up disabled"]
["01","wake-up on falling edge"]
["10","wake-up on rising edge"]
["11","wake-up on both edges"]
[]
[null,"usb_crt_src_sel"]
["00","USB crt source 0 mA"]
["01","USB crt source 5 mA"]
["10","USB crt source 10 mA"]
["11","USB crt source 20 mA"]
[]
[1,"SPI 3 wires"]
[0,"SPI 4 wires"]
[]
[null,"frc_prim_dcdc_dis","vaux_gnd2_en","vaux_gnd1_en","vaux_gnd0_en","vaux2_en","vaux1_en","vaux0_en","sleep_vsup"]
["0","DCDC on at start-up","VAUX_GND2 off at start-up","VAUX_GND1 off at start-up","VAUX_GND0 off at start-up","VAUX2 off at start-up","VAUX1 off at start-up","VAUX0 off at start-up","VSUP on at start-up"]
["1","DCDC off at start-up","VAUX_GND2 on at start-up","VAUX_GND1 on at start-up","VAUX_GND0 on at start-up","VAUX2 on at start-up","VAUX1 on at start-up","VAUX0 on at start-up","VSUP sleep at start-up"]
[]
[]
[1,"HRV check by Ishort-cut"]
[0,"HRV check by Vopen-voltage"]
[]
[]
[null,"prim_cell_connect","prim_cell","no_bat_protect"]
[0,"STS/LTS disconnet at start-up","rechargeable battery","battery protection on"]
[1,"STS/LTS connect at start-up","non-rechargeable battery","battery protection off"]
[]
[]
[null,"vsup_tied_low","frc_ulp_ldo"]
[0,"VSUP float when off","VSUP LDO auto"]
[1,"VSUP to GND when off","VSUP LDO forced"]
[]
[]
["Switches resistivity"]
[]
["VDD_LTS to VDD_STS ","Rsw_LTS_STS","VDD_STS at 3V",null,3.1,null,"Ω"]
["VDD_STS to VSUP","Rsw_VSUP","VDD_STS at 3V",null,7.4,null,"Ω"]
["VDD_STS to VAUX[0] ","Rsw_VAUX0","VDD_STS at 3V",null,4.4000000000000004,null,"Ω"]
["VDD_STS to VAUX[1] ","Rsw_VAUX1","VDD_STS at 3V",null,5.8,null,"Ω"]
["VDD_STS to VAUX[2] ","Rsw_VAUX2","VDD_STS at 3V",null,6.4,null,"Ω"]
["VAUX_GND[0] to VSS ","Rsw_GND0","VDD_STS at 3V",null,4.74,null,"Ω"]
["VAUX_GND[1,2] to VSS ","Rsw_GND1,2","VDD_STS at 3V",null,5.62,null,"Ω"]

{"sheet":"messages","index":4,"n_rows":80,"n_cols":1,"rows_kept":80,"cut":false,"hidden":true,"merged":[]}
["Exception messages"]
["ERRORS:"]
[{"$f":"(\"ERROR: TEG resistivity cannot be higher than \"&constants!D18&\" Ohm when v_bat_max_hi > 3V\")","v":"ERROR: TEG resistivity cannot be higher than 3350 Ohm when v_bat_max_hi > 3V"}]
[{"$f":"(\"ERROR: TEG resistivity cannot be higher than \"&constants!C18&\" Ohm when v_bat_max_hi is in the range 2V-3V\")","v":"ERROR: TEG resistivity cannot be higher than 8390 Ohm when v_bat_max_hi is in the range 2V-3V"}]
[{"$f":"(\"ERROR: TEG resistivity cannot be higher than \"&constants!B18&\" Ohm when v_bat_max_hi < 2V\")","v":"ERROR: TEG resistivity cannot be higher than 16780 Ohm when v_bat_max_hi < 2V"}]
[{"$f":"\"ERROR: Maximum HRV open voltage higher than \"&constants!D22&\" V\"","v":"ERROR: Maximum HRV open voltage higher than 4.2 V"}]
[{"$f":"\"ERROR: Minimum HRV open voltage lower than \"&constants!B22&\" V\"","v":"ERROR: Minimum HRV open voltage lower than 1.8 V"}]
["ERROR: Vpp_min is too low for v_bat_max_hi range"]
[{"$f":"\"ERROR: Chrv is out of range \"&constants!B46&\"uF - \"&constants!D46&\"uF\"","v":"ERROR: Chrv is out of range 2.2uF - 10uF"}]
["ERROR: Effective Ihrv_lim is lower than absolute minimum allowed"]
["ERROR: t_hrv_meas longer than maximum configurable value"]
[{"$f":"\"ERROR: Effective t_hrv_meas shorter than \"&settings!B29&\" ms\"","v":"ERROR: Effective t_hrv_meas shorter than 1 ms"}]
["ERROR: t_hrv_period too short compare to t_hrv_meas"]
[{"$f":"\"ERROR: v_bat_max_hi is set higher than \"&constants!$D$67&\"V\"","v":"ERROR: v_bat_max_hi is set higher than 4.2V"}]
["ERROR: v_apl_max_hi is set lower or too close to v_bat_min_lo"]
[{"$f":"\"ERROR: v_apl_max_hi is set higher than \"&constants!$D$67&\"V\"","v":"ERROR: v_apl_max_hi is set higher than 4.2V"}]
[{"$f":"\"ERROR: v_bat_min_lo is set lower than \"&constants!B68&\"V\"","v":"ERROR: v_bat_min_lo is set lower than 1.47V"}]
["ERROR: v_bat_max_hi is set lower or too close to v_bat_min_lo"]
[{"$f":"\"ERROR: Csup too low, shall be at least \"&constants!B71&\"uF when ULP LDO is used\"","v":"ERROR: Csup too low, shall be at least 1uF when ULP LDO is used"}]
[{"$f":"\"ERROR: Caux0 too low, shall be at least \"&constants!B72&\"uF when VAUX LDO is used\"","v":"ERROR: Caux0 too low, shall be at least 1uF when VAUX LDO is used"}]
[{"$f":"\"ERROR: Caux1 too low, shall be at least \"&constants!B73&\"uF when VAUX LDO is used\"","v":"ERROR: Caux1 too low, shall be at least 1uF when VAUX LDO is used"}]
[{"$f":"\"ERROR: Caux2 too low, shall be at least \"&constants!B74&\"uF when VAUX LDO is used\"","v":"ERROR: Caux2 too low, shall be at least 1uF when VAUX LDO is used"}]
["ERROR: Csts is too low compare to the sum of decoupling capacitor switched on together"]
["ERROR: Csts is lower than 10uF"]
["ERROR: Tsts shall not be bigger than 256ms"]
[{"$f":"\"ERROR: Effective Tsts_period shall be higher or equal to \"&CEILING(settings!B61,1)&\" ms\"","v":"ERROR: Effective Tsts_period shall be higher or equal to 1 ms"}]
["ERROR: v_bat_min_hi_dis is higher or too close to v_apl_max_hi: increase Csts or increase VLDloss"]
["ERROR: v_apl_max_lo is lower or too close to v_bat_min_hi_dis or v_bat_min_hi_con: increase Csts or increase VLDloss"]
["ERROR: v_bat_min_hi_con is higher or too close to v_apl_max_lo or v_bat_max_lo : peak current too high for such battery resistivity or application voltage too low"]
["ERROR: Not enough margin between v_apl_max_lo and v_apl_max_hi: increase Csts or decrease Tsts_period"]
["ERROR: Not enough margin between v_apl_max_lo and v_bat_min_hi_dis: voltage peaks on STS too high: decrease Tlts_charge_min, Increase Csts or increase VLDloss"]
["ERROR: v_apl_max_lo is lower or too close to v_bat_min_hi_con: v_apl_max_lo is extremely low"]
["ERROR: Not enough margin between v_bat_max_lo and v_bat_min_hi_dis: voltage peaks on STS too high: decrease Tlts_charge_min, Increase Csts or increase VLDloss"]
["ERROR: Not enough margin between v_bat_max_hi and v_apl_max_hi: reduce maximum application voltage or set set v_apl_max_hi = v_bat_max_hi"]
["ERROR: Not enough margin between v_bat_max_lo and v_apl_max_hi: reduce maximum application voltage or set set v_apl_max_hi = v_bat_max_hi"]
["ERROR: v_bat_max_lo is lower or too close to v_bat_min_hi_con: v_bat_max_lo is extremely low"]
["ERROR: t_sleep_vsup is higher than the maximum delay of 4h 39min 37s 215ms"]
["ERROR: t_sleep_vsup must be higher than 0s"]
["ERROR: I2C address out of range (>7F)"]
["ERROR: shall not be enabled at start-up is unused"]
["ERROR"]
["FATAL ERRORS:"]
["FATAL ERROR: v_bat_max_hi shall be higher than v_bat_max_lo"]
["FATAL ERROR: v_apl_max_hi shall be higher than v_apl_max_lo"]
["FATAL ERROR: v_bat_min_hi shall be higher than v_bat_min_lo"]
["FATAL ERROR: v_bat_min_hi shall be lower than v_apl_max_lo"]
["FATAL ERROR: v_bat_min_hi shall be lower than v_bat_max_lo"]
["FATAL ERROR: wake_up_edge_cfg[1:0] cannot be set to \"00\""]
["WARNINGS:"]
["WARNING: MPPT ratio for a TEG is usually 50%"]
["WARNING: MPPT ratio for a solar cell is usually close to 80%"]
["WARNING: Open voltage measurement method should be used to supervise a TEG"]
["WARNING: Short-cut measurement method should be used to supervise a Solar cell"]
[{"$f":"\"WARNING: t_hrv_period short, loss due to HRV-CHECK = \"&100*64/settings!B31&\"%\"","v":"WARNING: t_hrv_period short, loss due to HRV-CHECK = 6.25%"}]
["WARNING: LTS/STS shall not be always connected to each other with a non-rechargeable battery."]
["WARNING: no under voltage protection on LTS has been set"]
["WARNING: \"Rechargeable battery = No\" AND \"STS always connected to LTS = Yes\" set together. "]
["WARNING: VSUP IS DISABLED IN HRV LOW MODE. IT IS STRONGLY RECOMMANDED TO AVOID THAT."]
["WARNING: ULP LDO voltage level is lower than v_bat_max_lo; the ULP LDO could act as a follower, not as a regulator"]
["WARNING: VAUX[0] and VSUP could be at different voltage domain"]
["WARNING: VAUX[1] and VSUP could be at different voltage domain"]
["WARNING: VAUX[2] and VSUP could be at different voltage domain"]
["WARNING: VAUX LDO voltage level is lower than v_bat_max_lo; the VAUX LDO could act as a follower, not as a regulator"]
["WARNING: Some registers have been overwritten in the register map"]
["WARNING: WAKE-UP SHALL BE ENABLED WHEN VSUP IS IN SLEEP CONDITION AT START-UP"]
["WARNING"]
["NOTES:"]
["Note: the power consumption of the HRV supervisory & sampling in HRV LOW mode is: "]
["Note: the power consumption of the VLD used to measure LTS is: "]
["Note: the power consumption of the VLD used to measure LTS in HRV LOW mode is: "]
["START-UP"]
["MAINTAIN STS"]
["CONNECT APPLI"]
["OPERATING"]
["CONNECT LTS/STS"]
[]
["All OK"]
["OK"]
["OK (Not applicable)"]
["N.A. short-cut method used"]

{"sheet":"txt source","index":5,"n_rows":53,"n_cols":2,"rows_kept":53,"cut":false,"hidden":true,"merged":[]}
[{"$f":"'register map'!B3","v":"0x40"},{"$f":"'register map'!G3","v":"0x02"}]
[{"$f":"'register map'!B4","v":"0x41"},{"$f":"'register map'!G4","v":"0x02"}]
[{"$f":"'register map'!B5","v":"0x42"},{"$f":"'register map'!G5","v":"0x00"}]
[{"$f":"'register map'!B6","v":"0x43"},{"$f":"'register map'!G6","v":"0x02"}]
[{"$f":"'register map'!B7","v":"0x44"},{"$f":"'register map'!G7","v":"0x01"}]
[{"$f":"'register map'!B8","v":"0x45"},{"$f":"'register map'!G8","v":"0x02"}]
[{"$f":"'register map'!B9","v":"0x46"},{"$f":"'register map'!G9","v":"0x00"}]
[{"$f":"'register map'!B10","v":"0x47"},{"$f":"'register map'!G10","v":"0x24"}]
[{"$f":"'register map'!B11","v":"0x48"},{"$f":"'register map'!G11","v":"0x23"}]
[{"$f":"'register map'!B12","v":"0x49"},{"$f":"'register map'!G12","v":"0x1A"}]
[{"$f":"'register map'!B13","v":"0x4A"},{"$f":"'register map'!G13","v":"0x1A"}]
[{"$f":"'register map'!B14","v":"0x4B"},{"$f":"'register map'!G14","v":"0x18"}]
[{"$f":"'register map'!B15","v":"0x4C"},{"$f":"'register map'!G15","v":"0x3F"}]
[{"$f":"'register map'!B16","v":"0x4D"},{"$f":"'register map'!G16","v":"0x3E"}]
[{"$f":"'register map'!B17","v":"0x4E"},{"$f":"'register map'!G17","v":"0xD7"}]
[{"$f":"'register map'!B18","v":"0x4F"},{"$f":"'register map'!G18","v":"0x00"}]
[{"$f":"'register map'!B19","v":"0x50"},{"$f":"'register map'!G19","v":"0x00"}]
[{"$f":"'register map'!B20","v":"0x51"},{"$f":"'register map'!G20","v":"0x00"}]
[{"$f":"'register map'!B21","v":"0x52"},{"$f":"'register map'!G21","v":"0x06"}]
[{"$f":"'register map'!B22","v":"0x53"},{"$f":"'register map'!G22","v":"0x51"}]
[{"$f":"'register map'!B23","v":"0x54"},{"$f":"'register map'!G23","v":"0xE8"}]
[{"$f":"'register map'!B24","v":"0x55"},{"$f":"'register map'!G24","v":"0x03"}]
[{"$f":"'register map'!B25","v":"0x56"},{"$f":"'register map'!G25","v":"0x00"}]
[{"$f":"'register map'!B26","v":"0x57"},{"$f":"'register map'!G26","v":"0x22"}]
[{"$f":"'register map'!B27","v":"0x58"},{"$f":"'register map'!G27","v":"0x77"}]
[{"$f":"'register map'!B28","v":"0x59"},{"$f":"'register map'!G28","v":"0x01"}]
[{"$f":"'register map'!B29","v":"0x5A"},{"$f":"'register map'!G29","v":"0xFF"}]
[{"$f":"'register map'!B30","v":"0x5B"},{"$f":"'register map'!G30","v":"0xFF"}]
[{"$f":"'register map'!B31","v":"0x5C"},{"$f":"'register map'!G31","v":"0xFF"}]
[{"$f":"'register map'!B32","v":"0x5D"},{"$f":"'register map'!G32","v":"0xFF"}]
[{"$f":"'register map'!B33","v":"0x5E"},{"$f":"'register map'!G33","v":"0xFF"}]
[{"$f":"'register map'!B34","v":"0x5F"},{"$f":"'register map'!G34","v":"0xFF"}]
[{"$f":"'register map'!B35","v":"0x60"},{"$f":"'register map'!G35","v":"0xFF"}]
[{"$f":"'register map'!B36","v":"0x61"},{"$f":"'register map'!G36","v":"0xFF"}]
[{"$f":"'register map'!B37","v":"0x62"},{"$f":"'register map'!G37","v":"0xFF"}]
[{"$f":"'register map'!B38","v":"0x63"},{"$f":"'register map'!G38","v":"0xFF"}]
[{"$f":"'register map'!B39","v":"0x64"},{"$f":"'register map'!G39","v":"0xFF"}]
[{"$f":"'register map'!B40","v":"0x65"},{"$f":"'register map'!G40","v":"0xFF"}]
[{"$f":"'register map'!B41","v":"0x66"},{"$f":"'register map'!G41","v":"0xFF"}]
[{"$f":"'register map'!B42","v":"0x67"},{"$f":"'register map'!G42","v":"0xFF"}]
[{"$f":"'register map'!B43","v":"0x68"},{"$f":"'register map'!G43","v":"0xFF"}]
[{"$f":"'register map'!B44","v":"0x69"},{"$f":"'register map'!G44","v":"0xFF"}]
[{"$f":"'register map'!B45","v":"0x6A"},{"$f":"'register map'!G45","v":"0xFF"}]
[{"$f":"'register map'!B46","v":"0x6B"},{"$f":"'register map'!G46","v":"0xFF"}]
[{"$f":"'register map'!B47","v":"0x6C"},{"$f":"'register map'!G47","v":"0xFF"}]
[{"$f":"'register map'!B48","v":"0x6D"},{"$f":"'register map'!G48","v":"0xFF"}]
[{"$f":"'register map'!B49","v":"0x6E"},{"$f":"'register map'!G49","v":"0xFF"}]
[{"$f":"'register map'!B50","v":"0x6F"},{"$f":"'register map'!G50","v":"0xFF"}]
[{"$f":"'register map'!B51","v":"0x70"},{"$f":"'register map'!G51","v":"0xFF"}]
[{"$f":"'register map'!B52","v":"0x71"},{"$f":"'register map'!G52","v":"0xFF"}]
[{"$f":"'register map'!B53","v":"0x72"},{"$f":"'register map'!G53","v":"0xFF"}]
[{"$f":"'register map'!B54","v":"0x73"},{"$f":"'register map'!G54","v":"0xFF"}]
[{"$f":"'register map'!B55","v":"0x74"},{"$f":"'register map'!G55","v":"0xFF"}]

{"sheet":"chart calc","index":6,"n_rows":376,"n_cols":27,"rows_kept":376,"cut":false,"hidden":true,"merged":[[72,24,72,26],[72,2,72,3],[72,4,72,5],[7,2,7,7],[7,9,7,11],[72,8,72,9],[72,18,72,20],[72,6,72,7],[72,21,72,23]]}
["EM8500 chart illustration calculation"]
["Description","The timing diagram is divided in 3 phases:"]
[null,"-1. start-up phase (ULV DCDC or connection to LTS depending if STS/LTS can be disconnected)"]
[null,"-2. STS maintaining if STS and LTS are disconnected otherwise operating mode"]
[null,"-3. operating mode, LTS and STS connected"]
[]
["Rechargeable battery",{"$f":"settings!B36","v":"Yes"}]
["STS always connected to LTS",{"$f":"settings!B46","v":"Yes"},"STS/LTS unconnected",null,null,null,null,null,null,"STS/LTS connected"]
["VLDlsb",{"$f":"constants!C64","v":7.2999999999999995E-2},null,{"$f":"IF(B12=-1,B11,B13)","v":2.6279999999999997},1.25,null,null,null,null,null,{"$f":"B10","v":2.7009999999999996},2]
[{"$f":"\"v_bat_max_hi (\"&TEXT(B10,\"0.00\")&\")\"","v":"v_bat_max_hi (2.70)"},{"$f":"('register map'!L10+1)*'chart calc'!B9","v":2.7009999999999996},null,{"$f":"B18","v":1.3},1,null,null,null,null,null,{"$f":"F76","v":2.2994999999999997},1]
[{"$f":"\"v_bat_max_lo (\"&TEXT(B11,\"0.00\")&\")\"","v":"v_bat_max_lo (2.63)"},{"$f":"('register map'!L11+1)*B9","v":2.6279999999999997},"SLOPE1",{"$f":"SLOPE(D9:D10,E9:E10)","v":5.3119999999999985},null,null,null,null,null,"SLOPE1",{"$f":"SLOPE(K9:K10,L9:L10)","v":0.40149999999999997}]
[{"$f":"\"v_apl_max_hi (\"&TEXT(B12,\"0.00\")&\")\"","v":"v_apl_max_hi (-1.00)"},{"$f":"IF('register map'!L15>'register map'!L10,-1,('register map'!L15+1)*B9)","v":-1},"INTERCEPT1",{"$f":"INTERCEPT(D9:D10,E9:E10)","v":-4.0119999999999987},null,null,null,null,null,"INTERCEPT1",{"$f":"INTERCEPT(K9:K10,L9:L10)","v":1.8979999999999995}]
[{"$f":"\"v_apl_max_lo (\"&TEXT(B13,\"0.00\")&\")\"","v":"v_apl_max_lo (-1.00)"},{"$f":"IF('register map'!L15>'register map'!L10,-1,('register map'!L16+1)*B9)","v":-1},null,{"$f":"B16","v":1.9709999999999999},1.5,null,{"$f":"(B16+G14)/2","v":1.3105},1.5,null,null,{"$f":"B11","v":2.6279999999999997},2.5]
[{"$f":"\"v_bat_min_hi_dis (\"&TEXT(B14,\"0.00\")&\")\"","v":"v_bat_min_hi_dis (1.97)"},{"$f":"('register map'!L12+1)*B9","v":1.9709999999999999},null,{"$f":"D9","v":2.6279999999999997},1.25,null,{"$f":"D201","v":0.65},1.25,null,null,{"$f":"K9","v":2.7009999999999996},2]
[{"$f":"\"v_bat_min_hi_con (\"&TEXT(B15,\"0.00\")&\")\"","v":"v_bat_min_hi_con (1.97)"},{"$f":"('register map'!L13+1)*B9","v":1.9709999999999999},"SLOPE2",{"$f":"SLOPE(D13:D14,E13:E14)","v":-2.6279999999999992},null,null,{"$f":"SLOPE(G13:G14,H13:H14)","v":2.6419999999999999},null,null,"SLOPE2",{"$f":"SLOPE(K13:K14,L13:L14)","v":-0.14599999999999991}]
[{"$f":"\"v_bat_min_hi (\"&TEXT(B16,\"0.00\")&\")\"","v":"v_bat_min_hi (1.97)"},{"$f":"IF(B8=\"No\",B14,B15)","v":1.9709999999999999},"INTERCEPT2",{"$f":"INTERCEPT(D13:D14,E13:E14)","v":5.9129999999999985},null,null,{"$f":"INTERCEPT(G13:G14,H13:H14)","v":-2.6524999999999999},null,null,"INTERCEPT2",{"$f":"INTERCEPT(K13:K14,L13:L14)","v":2.9929999999999994}]
[{"$f":"\"v_bat_min_lo (\"&TEXT(B17,\"0.00\")&\")\"","v":"v_bat_min_lo (1.83)"},{"$f":"('register map'!L14+1)*B9","v":1.825},null,{"$f":"D14","v":2.6279999999999997},1.75,null,null,null,null,null,{"$f":"K14","v":2.7009999999999996},3]
[{"$f":"\"Vcs_hi (\"&TEXT(B18,\"0.00\")&\")\"","v":"Vcs_hi (1.30)"},{"$f":"constants!B154","v":1.3},null,{"$f":"D13","v":1.9709999999999999},1.5,null,null,null,null,null,{"$f":"K13","v":2.6279999999999997},2.5]
[null,null,"SLOPE3",{"$f":"SLOPE(D17:D18,E17:E18)","v":2.6279999999999992},null,null,null,null,null,"SLOPE3",{"$f":"SLOPE(K17:K18,L17:L18)","v":0.14599999999999991}]
["ULP LDO",{"$f":"settings!B97","v":2.6},"INTERCEPT3",{"$f":"INTERCEPT(D17:D18,E17:E18)","v":-1.9709999999999988},null,null,null,null,null,"INTERCEPT3",{"$f":"INTERCEPT(K17:K18,L17:L18)","v":2.2629999999999999}]
["VAUX LDO",{"$f":"settings!B108","v":2.2000000000000002},null,{"$f":"D18","v":1.9709999999999999},2,null,{"$f":"D21","v":1.9709999999999999},2]
["Force ULP LDO",{"$f":"settings!B96","v":"No"},null,{"$f":"D17","v":2.6279999999999997},1.75,null,{"$f":"G13","v":1.3105},1.75]
[null,null,"SLOPE4",{"$f":"SLOPE(D21:D22,E21:E22)","v":-2.6279999999999992},null,null,{"$f":"SLOPE(G21:G22,H21:H22)","v":2.6419999999999995}]
[null,null,"INTERCEPT4",{"$f":"INTERCEPT(D21:D22,E21:E22)","v":7.2269999999999985},null,null,{"$f":"INTERCEPT(G21:G22,H21:H22)","v":-3.3129999999999997}]
[]
[]
[null,null,null,{"$f":"B10","v":2.7009999999999996},2.25]
["v_bat_max_hi (2.88)",null,null,{"$f":"D21","v":1.9709999999999999},2]
["v_bat_max_lo",null,"SLOPE4",{"$f":"SLOPE(D27:D28,E27:E28)","v":2.919999999999999},null,null,null,null,0.3]
["v_apl_max_hi",null,"INTERCEPT4",{"$f":"INTERCEPT(D27:D28,E27:E28)","v":-3.8689999999999984},null,null,{"$f":"messages!A71","v":"START-UP"},0.5,{"$f":"$B$10+I29","v":3.0009999999999994},{"$f":"7","v":7}]
["v_apl_max_lo",null,null,{"$f":"B11","v":2.6279999999999997},2.5,null,{"$f":"IF(B8=constants!C60,messages!A72,messages!A73)","v":"CONNECT APPLI"},1.5,{"$f":"I30","v":3.0009999999999994},{"$f":"7","v":7}]
["v_bat_min_hi_dis",null,null,{"$f":"D27","v":2.7009999999999996},2.25,null,{"$f":"IF(B7=constants!B60,messages!A74,messages!A75)","v":"OPERATING"},2.5,{"$f":"I31","v":3.0009999999999994},{"$f":"7","v":7}]
["v_bat_min_hi_con",null,"SLOPE5",{"$f":"SLOPE(D31:D32,E31:E32)","v":-0.29199999999999982}]
["v_bat_min_hi",null,"INTERCEPT5",{"$f":"INTERCEPT(D31:D32,E31:E32)","v":3.3579999999999988}]
["v_bat_min_lo",null,null,{"$f":"D32","v":2.7009999999999996},2.75]
["Vcs_hi"]
[]
[]
[null,null,null,null,null,null,{"$f":"IF(B13=-1,B11,B13)","v":2.6279999999999997},1.25]
[null,null,null,{"$f":"D31","v":2.6279999999999997},2.5,null,{"$f":"G175","v":2.1854999999999989},1]
[null,null,"SLOPE5",{"$f":"SLOPE(D35:D40,E35:E40)","v":0.29199999999999982},null,null,"SLOPE LTS",{"$f":"SLOPE(G39:G40,H39:H40)","v":1.7700000000000031}]
[null,null,"INTERCEPT5",{"$f":"INTERCEPT(D35:D40,E35:E40)","v":1.8979999999999999},null,null,"INTERCEPT LTS",{"$f":"INTERCEPT(G39:G40,H39:H40)","v":0.41549999999999576}]
[null,null,null,{"$f":"D40","v":2.6279999999999997},3]
[null,null,null,{"$f":"D35","v":2.7009999999999996},2.75,null,{"$f":"B16","v":1.9709999999999999},1.5]
[null,null,"SLOPE5",{"$f":"SLOPE(D43:D44,E43:E44)","v":-0.29199999999999982},null,null,{"$f":"G39","v":2.6279999999999997},{"$f":"H39","v":1.25}]
[null,null,"INTERCEPT5",{"$f":"INTERCEPT(D43:D44,E43:E44)","v":3.5039999999999987},null,null,"SLOPE LTS",{"$f":"SLOPE(G44:G45,H44:H45)","v":-2.6279999999999992}]
[null,null,null,null,null,null,"INTERCEPT LTS",{"$f":"INTERCEPT(G44:G45,H44:H45)","v":5.9129999999999985}]
[]
[null,null,null,null,null,null,{"$f":"G45","v":2.6279999999999997},1.75]
[null,null,null,null,null,null,{"$f":"G44","v":1.9709999999999999},{"$f":"H44","v":1.5}]
[null,null,null,null,null,null,"SLOPE LTS",{"$f":"SLOPE(G49:G50,H49:H50)","v":2.6279999999999992}]
[null,null,null,null,null,null,"INTERCEPT LTS",{"$f":"INTERCEPT(G49:G50,H49:H50)","v":-1.9709999999999988}]
[]
[null,null,null,null,null,null,{"$f":"H275-H74","v":2.1854999999999989},2]
[null,null,null,null,null,null,{"$f":"G49","v":2.6279999999999997},{"$f":"H49","v":1.75}]
[null,null,null,null,null,null,"SLOPE LTS",{"$f":"SLOPE(G54:G55,H54:H55)","v":-1.7700000000000031}]
[null,null,null,null,null,null,"INTERCEPT LTS",{"$f":"INTERCEPT(G54:G55,H54:H55)","v":5.7255000000000056}]
[]
[]
[]
[null,null,null,null,null,null,{"$f":"G62-H72","v":2.1004999999999989},3]
[null,null,null,null,null,null,{"$f":"H176","v":2.200499999999999},2]
[null,null,null,null,null,null,"SLOPE LTS",{"$f":"SLOPE(G61:G62,H61:H62)","v":-0.10000000000000009}]
[null,null,null,null,null,null,"INTERCEPT LTS",{"$f":"INTERCEPT(G61:G62,H61:H62)","v":2.4004999999999992}]
[]
[null,null,null,null,null,null,{"$f":"G67-H72","v":2.1994999999999996},1]
[null,null,null,null,null,null,{"$f":"H76","v":2.2994999999999997},0]
[null,null,null,null,null,null,"SLOPE LTS",{"$f":"SLOPE(G66:G67,H66:H67)","v":-0.10000000000000009}]
[null,null,null,null,null,null,"INTERCEPT LTS",{"$f":"INTERCEPT(G66:G67,H66:H67)","v":2.2994999999999992}]
[]
[null,null,null,null,null,null,null,null,null,null,null,null,null,null,null,null,null,null,{"$f":"settings!$H$105","v":0},{"$f":"settings!$H$106","v":0},{"$f":"settings!$H$107","v":0}]
[null,null,null,null,null,null,null,0.1,null,0,0,0.01,null,null,0.01,0.02,null,null,{"$f":"IF(settings!$B$99=constants!$C$60,0,1)","v":0},{"$f":"IF(settings!$B$100=constants!$C$60,0,1)","v":0},{"$f":"IF(settings!$B$101=constants!$C$60,0,1)","v":0},0,0,0,0.03,3.5000000000000003E-2,0.04]
[null,null,"STS/LTS unconnected",null,"STS/LTS connected",null,"Primary cell",null,"EFFECTIVE",null,null,"VSUP to STS","VSUP to LDO2","VSUP to LDO1","VSUP intermadiate","EFFECTIVE","VAUX to LDO1","VAUX to LDO","VAUX SELECTION",null,null,"VAUX SELECTION WITHOUT OFFSET",null,null,"EFFECTIVE"]
[null,null,0.3,1.4999999999999999E-2,0.01,1.4999999999999999E-2,0.01,1.4999999999999999E-2,null,null,null,1,1,1,0.9,1,1,1,1,1,1,0.9,0.9,0.9,0.9,0.9,0.9]
["phase","t","VDD_STS","VDD_LTS","VDD_STS","VDD_LTS","VDD_STS","VDD_LTS","VDD_STS","VDD_LTS","HYST STS VS BAT_MIN","VSUP","VSUP","VSUP","VSUP","VSUP","VAUX","VAUX","VAUX0","VAUX1","VAUX2","VAUX0","VAUX1","VAUX2","VAUX0","VAUX1","VAUX2"]
[{"$f":"IF(B76<=100,1,IF(B76<=200,2,3))","v":1},0,{"$f":"$B$18/(1-EXP(-1/C$74))*(1-EXP(-$B76/C$74))","v":0},{"$f":"$B$18/2","v":0.65},{"$f":"($F$76-$F$74)/(1-EXP(-1/E$74))*(1-EXP(-$B76/E$74))","v":0},{"$f":"IF(B12=-1,(B11+B16)/2,(B11+B16)/2)","v":2.2994999999999997},{"$f":"(H76-$H$74)/(1-EXP(-1/G$74))*(1-EXP(-$B76/G$74))","v":0},{"$f":"IF(B12=-1,(B11+B16)/2,(B11+B16)/2)","v":2.2994999999999997},{"$f":"IF($B$7=constants!$C$60,G76,IF($B$8=constants!$C$60,C76,E76))","v":0},{"$f":"IF($B$7=constants!$C$60,H76,IF($B$8=constants!$C$60,D76,F76))","v":2.2994999999999997},0,0,0,0,0,{"$f":"IF(O76=0,0,O76-$P$72)","v":0},0,0,{"$f":"S$72*IF(S$71=0,$L76,IF(S$71=1,$R76,IF($B$12=-1,$L76,IF($I76>$B$12,$R76,$L76))))","v":0},{"$f":"T$72*IF(T$71=0,$L76,IF(T$71=1,$R76,IF($B$12=-1,$L76,IF($I76>$B$12,$R76,$L76))))","v":0},{"$f":"U$72*IF(U$71=0,$L76,IF(U$71=1,$R76,IF($B$12=-1,$L76,IF($I76>$B$12,$R76,$L76))))","v":0},0,0,0,{"$f":"IF(V76=0,0,V76-Y$72)","v":0},{"$f":"IF(W76=0,0,W76-Z$72)","v":0},{"$f":"IF(X76=0,0,X76-AA$72)","v":0}]
[{"$f":"IF(B77<=100,1,IF(B77<=200,2,3))","v":1},{"$f":"B76+0.01","v":0.01},{"$f":"$B$18/(1-EXP(-1/$C$74))*(1-EXP(-B77/$C$74))","v":4.4195706720931975E-2},{"$f":"D76","v":0.65},1.4440794166438398,{"$f":"F76","v":2.2994999999999997},1.4434472960850109,{"$f":"$H$68*B77+$H$69","v":2.2984999999999993},{"$f":"IF($B$7=constants!$C$60,G77,IF($B$8=constants!$C$60,C77,E77))","v":1.4440794166438398},{"$f":"IF($B$7=constants!$C$60,H77,IF($B$8=constants!$C$60,D77,F77))","v":2.2994999999999997},{"$f":"IF(AND(I77>$B$16,K76=0),1,IF(AND(I77<$B$17,K76=1),0,K76))","v":0},0,0,{"$f":"IF(M77>I77,L77,M77)","v":0},{"$f":"IF(OR($B$22=constants!$B$60,AND(I77>$B$12,$B$12<>-1)),O76+(N77-O76)*$O$74,O76+(L77-O76)*$O$74)","v":0},{"$f":"IF(O77=0,0,O77-$P$72)","v":0},0,{"$f":"IF(Q77>I77,I77,Q77)","v":0},{"$f":"S$72*IF(S$71=0,$L77,IF(S$71=1,$R77,IF($B$12=-1,$L77,IF($I77>$B$12,$R77,$L77))))","v":0},0,0,{"$f":"V76+(S77-V$72-V76)*V$74","v":0},{"$f":"W76+(T77-W$72-W76)*W$74","v":0},{"$f":"X76+(U77-X$72-X76)*X$74","v":0},{"$f":"IF(V77=0,0,V77-Y$72)","v":0},{"$f":"IF(W77=0,0,W77-Z$72)","v":0},{"$f":"IF(X77=0,0,X77-AA$72)","v":0}]
[1,{"$f":"B77+0.01","v":0.02},8.6942505833598124E-2,{"$f":"D77","v":0.65},1.9753265454459579,{"$f":"F77","v":2.2994999999999997},1.9735972160124309,2.2974999999999994,{"$f":"IF($B$7=constants!$C$60,G78,IF($B$8=constants!$C$60,C78,E78))","v":1.9753265454459579},{"$f":"IF($B$7=constants!$C$60,H78,IF($B$8=constants!$C$60,D78,F78))","v":2.2994999999999997},{"$f":"IF(AND(I78>$B$16,K77=0),1,IF(AND(I78<$B$17,K77=1),0,K77))","v":1},0,0,0,{"$f":"IF(OR($B$22=constants!$B$60,AND(I78>$B$12,$B$12<>-1)),O77+(N78-O77)*$O$74,O77+(L78-O77)*$O$74)","v":0},0,0,{"$f":"IF(Q78>I78,I78,Q78)","v":0},0,0,0,{"$f":"V77+(S78-V$72-V77)*V$74","v":0},{"$f":"W77+(T78-W$72-W77)*W$74","v":0},{"$f":"X77+(U78-X$72-X77)*X$74","v":0},0,0,0]
[1,0.03,0.12828789817943895,0.65,2.1707614423136143,2.2994999999999997,2.1679108035187173,2.2964999999999991,{"$f":"IF($B$7=constants!$C$60,G79,IF($B$8=constants!$C$60,C79,E79))","v":2.1707614423136143},{"$f":"IF($B$7=constants!$C$60,H79,IF($B$8=constants!$C$60,D79,F79))","v":2.2994999999999997},1,0,0,0,{"$f":"IF(OR($B$22=constants!$B$60,AND(I79>$B$12,$B$12<>-1)),O78+(N79-O78)*$O$74,O78+(L79-O78)*$O$74)","v":0},0,0,0,0,0,0,0,0,0,0,0,0]
[1,0.04,0.16827782733708141,0.65,2.2426579229586863,2.2994999999999997,2.2387311855142409,2.2954999999999992,{"$f":"IF($B$7=constants!$C$60,G80,IF($B$8=constants!$C$60,C80,E80))","v":2.2426579229586863},{"$f":"IF($B$7=constants!$C$60,H80,IF($B$8=constants!$C$60,D80,F80))","v":2.2994999999999997},1,0,0,0,{"$f":"IF(OR($B$22=constants!$B$60,AND(I80>$B$12,$B$12<>-1)),O79+(N80-O79)*$O$74,O79+(L80-O79)*$O$74)","v":0},0,0,0,0,0,0,0,0,0,0,0,0]
[1,0.05,0.20695673067548825,0.65,2.2691071600805888,2.2994999999999997,2.2641408498155839,2.2944999999999993,{"$f":"IF($B$7=constants!$C$60,G81,IF($B$8=constants!$C$60,C81,E81))","v":2.2691071600805888},{"$f":"IF($B$7=constants!$C$60,H81,IF($B$8=constants!$C$60,D81,F81))","v":2.2994999999999997},1,0,0,0,{"$f":"IF(OR($B$22=constants!$B$60,AND(I81>$B$12,$B$12<>-1)),O80+(N81-O80)*$O$74,O80+(L81-O80)*$O$74)","v":0},0,0,0,0,0,0,0,0,0,0,0,0]
[1,6.0000000000000005E-2,0.24436758873338243,0.65,2.278837290652405,2.2994999999999997,2.2728521631654646,2.293499999999999,{"$f":"IF($B$7=constants!$C$60,G82,IF($B$8=constants!$C$60,C82,E82))","v":2.278837290652405},{"$f":"IF($B$7=constants!$C$60,H82,IF($B$8=constants!$C$60,D82,F82))","v":2.2994999999999997},1,0,0,0,{"$f":"IF(OR($B$22=constants!$B$60,AND(I82>$B$12,$B$12<>-1)),O81+(N82-O81)*$O$74,O81+(L82-O81)*$O$74)","v":0},0,0,0,0,0,0,0,0,0,0,0,0]
[1,7.0000000000000007E-2,0.2805519729798247,0.65,2.2824168056496905,2.2994999999999997,2.2754231888234489,2.2924999999999991,{"$f":"IF($B$7=constants!$C$60,G83,IF($B$8=constants!$C$60,C83,E83))","v":2.2824168056496905},{"$f":"IF($B$7=constants!$C$60,H83,IF($B$8=constants!$C$60,D83,F83))","v":2.2994999999999997},1,0,0,0,{"$f":"IF(OR($B$22=constants!$B$60,AND(I83>$B$12,$B$12<>-1)),O82+(N83-O82)*$O$74,O82+(L83-O82)*$O$74)","v":0},0,0,0,0,0,0,0,0,0,0,0,0]
[1,0.08,0.31555009200901107,0.65,2.2837336356265561,2.2994999999999997,2.2757363193275788,2.2914999999999992,{"$f":"IF($B$7=constants!$C$60,G84,IF($B$8=constants!$C$60,C84,E84))","v":2.2837336356265561},{"$f":"IF($B$7=constants!$C$60,H84,IF($B$8=constants!$C$60,D84,F84))","v":2.2994999999999997},1,0,0,0,{"$f":"IF(OR($B$22=constants!$B$60,AND(I84>$B$12,$B$12<>-1)),O83+(N84-O83)*$O$74,O83+(L84-O83)*$O$74)","v":0},0,0,0,0,0,0,0,0,0,0,0,0]
[1,0.09,0.34940083622062584,0.65,2.2842180703025634,2.2994999999999997,2.2752191809908,2.2904999999999993,{"$f":"IF($B$7=constants!$C$60,G85,IF($B$8=constants!$C$60,C85,E85))","v":2.2842180703025634},{"$f":"IF($B$7=constants!$C$60,H85,IF($B$8=constants!$C$60,D85,F85))","v":2.2994999999999997},1,0,0,0,{"$f":"IF(OR($B$22=constants!$B$60,AND(I85>$B$12,$B$12<>-1)),O84+(N85-O84)*$O$74,O84+(L85-O84)*$O$74)","v":0},0,0,0,0,0,0,0,0,0,0,0,0]
[1,9.9999999999999992E-2,0.38214182103539768,0.65,2.284396283860457,2.2994999999999997,2.2743967378597545,2.2894999999999994,{"$f":"IF($B$7=constants!$C$60,G86,IF($B$8=constants!$C$60,C86,E86))","v":2.284396283860457},{"$f":"IF($B$7=constants!$C$60,H86,IF($B$8=constants!$C$60,D86,F86))","v":2.2994999999999997},1,0,0,0,{"$f":"IF(OR($B$22=constants!$B$60,AND(I86>$B$12,$B$12<>-1)),O85+(N86-O85)*$O$74,O85+(L86-O85)*$O$74)","v":0},0,0,0,0,0,0,0,0,0,0,0,0]
[1,0.10999999999999999,0.41380942869388193,0.65,2.284461844964544,2.2994999999999997,2.2734620286832521,2.2884999999999991,{"$f":"IF($B$7=constants!$C$60,G87,IF($B$8=constants!$C$60,C87,E87))","v":2.284461844964544},{"$f":"IF($B$7=constants!$C$60,H87,IF($B$8=constants!$C$60,D87,F87))","v":2.2994999999999997},1,0,0,0,{"$f":"IF(OR($B$22=constants!$B$60,AND(I87>$B$12,$B$12<>-1)),O86+(N87-O86)*$O$74,O86+(L87-O86)*$O$74)","v":0},0,0,0,0,0,0,0,0,0,0,0,0]
[1,0.11999999999999998,0.44443884868491507,0.65,2.2844859635468784,2.2994999999999997,2.2724860372774263,2.2874999999999992,{"$f":"IF($B$7=constants!$C$60,G88,IF($B$8=constants!$C$60,C88,E88))","v":2.2844859635468784},{"$f":"IF($B$7=constants!$C$60,H88,IF($B$8=constants!$C$60,D88,F88))","v":2.2994999999999997},1,0,0,0,{"$f":"IF(OR($B$22=constants!$B$60,AND(I88>$B$12,$B$12<>-1)),O87+(N88-O87)*$O$74,O87+(L88-O87)*$O$74)","v":0},0,0,0,0,0,0,0,0,0,0,0,0]
[1,0.12999999999999998,0.47406411684866784,0.65,2.2844948362774691,2.2994999999999997,2.2714948656617513,2.2864999999999993,{"$f":"IF($B$7=constants!$C$60,G89,IF($B$8=constants!$C$60,C89,E89))","v":2.2844948362774691},{"$f":"IF($B$7=constants!$C$60,H89,IF($B$8=constants!$C$60,D89,F89))","v":2.2994999999999997},1,0,0,0,{"$f":"IF(OR($B$22=constants!$B$60,AND(I89>$B$12,$B$12<>-1)),O88+(N89-O88)*$O$74,O88+(L89-O88)*$O$74)","v":0},0,0,0,0,0,0,0,0,0,0,0,0]
[1,0.13999999999999999,0.50271815319774638,0.65,2.2844981003726406,2.2994999999999997,2.2704981120140424,2.2854999999999994,{"$f":"IF($B$7=constants!$C$60,G90,IF($B$8=constants!$C$60,C90,E90))","v":2.2844981003726406},{"$f":"IF($B$7=constants!$C$60,H90,IF($B$8=constants!$C$60,D90,F90))","v":2.2994999999999997},1,0,0,0,{"$f":"IF(OR($B$22=constants!$B$60,AND(I90>$B$12,$B$12<>-1)),O89+(N90-O89)*$O$74,O89+(L90-O89)*$O$74)","v":0},0,0,0,0,0,0,0,0,0,0,0,0]
[1,0.15,0.53043279849837199,0.65,2.2844993011661483,2.2994999999999997,2.2694993057546826,2.2844999999999991,{"$f":"IF($B$7=constants!$C$60,G91,IF($B$8=constants!$C$60,C91,E91))","v":2.2844993011661483},{"$f":"IF($B$7=constants!$C$60,H91,IF($B$8=constants!$C$60,D91,F91))","v":2.2994999999999997},1,0,0,0,{"$f":"IF(OR($B$22=constants!$B$60,AND(I91>$B$12,$B$12<>-1)),O90+(N91-O90)*$O$74,O90+(L91-O90)*$O$74)","v":0},0,0,0,0,0,0,0,0,0,0,0,0]
[1,0.16,0.55723884965228487,0.65,2.2844997429133929,2.2994999999999997,2.2684997447139552,2.2834999999999992,{"$f":"IF($B$7=constants!$C$60,G92,IF($B$8=constants!$C$60,C92,E92))","v":2.2844997429133929},{"$f":"IF($B$7=constants!$C$60,H92,IF($B$8=constants!$C$60,D92,F92))","v":2.2994999999999997},1,0,0,0,{"$f":"IF(OR($B$22=constants!$B$60,AND(I92>$B$12,$B$12<>-1)),O91+(N92-O91)*$O$74,O91+(L92-O91)*$O$74)","v":0},0,0,0,0,0,0,0,0,0,0,0,0]
[1,0.17,0.5831660939186939,0.65,2.2844999054231225,2.2994999999999997,2.2674999061269117,2.2824999999999993,{"$f":"IF($B$7=constants!$C$60,G93,IF($B$8=constants!$C$60,C93,E93))","v":2.2844999054231225},{"$f":"IF($B$7=constants!$C$60,H93,IF($B$8=constants!$C$60,D93,F93))","v":2.2994999999999997},1,0,0,0,{"$f":"IF(OR($B$22=constants!$B$60,AND(I93>$B$12,$B$12<>-1)),O92+(N93-O92)*$O$74,O92+(L93-O92)*$O$74)","v":0},0,0,0,0,0,0,0,0,0,0,0,0]
[1,0.18000000000000002,0.6082433420142942,0.65,2.284499965207111,2.2994999999999997,2.2664999654812497,2.281499999999999,{"$f":"IF($B$7=constants!$C$60,G94,IF($B$8=constants!$C$60,C94,E94))","v":2.284499965207111},{"$f":"IF($B$7=constants!$C$60,H94,IF($B$8=constants!$C$60,D94,F94))","v":2.2994999999999997},1,0,0,0,{"$f":"IF(OR($B$22=constants!$B$60,AND(I94>$B$12,$B$12<>-1)),O93+(N94-O93)*$O$74,O93+(L94-O93)*$O$74)","v":0},0,0,0,0,0,0,0,0,0,0,0,0]
[1,0.19000000000000003,0.6324984601281407,0.65,2.284499987200411,2.2994999999999997,2.2654999873068635,2.2804999999999991,{"$f":"IF($B$7=constants!$C$60,G95,IF($B$8=constants!$C$60,C95,E95))","v":2.284499987200411},{"$f":"IF($B$7=constants!$C$60,H95,IF($B$8=constants!$C$60,D95,F95))","v":2.2994999999999997},1,0,0,0,{"$f":"IF(OR($B$22=constants!$B$60,AND(I95>$B$12,$B$12<>-1)),O94+(N95-O94)*$O$74,O94+(L95-O94)*$O$74)","v":0},0,0,0,0,0,0,0,0,0,0,0,0]
[1,0.20000000000000004,0.65595840088694579,0.65,2.2844999952912941,2.2994999999999997,2.2644999953325167,2.2794999999999992,{"$f":"IF($B$7=constants!$C$60,G96,IF($B$8=constants!$C$60,C96,E96))","v":2.2844999952912941},{"$f":"IF($B$7=constants!$C$60,H96,IF($B$8=constants!$C$60,D96,F96))","v":2.2994999999999997},1,0,0,0,{"$f":"IF(OR($B$22=constants!$B$60,AND(I96>$B$12,$B$12<>-1)),O95+(N96-O95)*$O$74,O95+(L96-O95)*$O$74)","v":0},0,0,0,0,0,0,0,0,0,0,0,0]
[1,0.21000000000000005,0.67864923330521598,0.65,2.2844999982677638,2.2994999999999997,2.2634999982836868,2.2784999999999993,{"$f":"IF($B$7=constants!$C$60,G97,IF($B$8=constants!$C$60,C97,E97))","v":2.2844999982677638},{"$f":"IF($B$7=constants!$C$60,H97,IF($B$8=constants!$C$60,D97,F97))","v":2.2994999999999997},1,0,0,0,{"$f":"IF(OR($B$22=constants!$B$60,AND(I97>$B$12,$B$12<>-1)),O96+(N97-O96)*$O$74,O96+(L97-O96)*$O$74)","v":0},0,0,0,0,0,0,0,0,0,0,0,0]
[1,0.22000000000000006,0.70059617175350608,0.65,2.2844999993627457,2.2994999999999997,2.2624999993688819,2.277499999999999,{"$f":"IF($B$7=constants!$C$60,G98,IF($B$8=constants!$C$60,C98,E98))","v":2.2844999993627457},{"$f":"IF($B$7=constants!$C$60,H98,IF($B$8=constants!$C$60,D98,F98))","v":2.2994999999999997},1,0,0,0,{"$f":"IF(OR($B$22=constants!$B$60,AND(I98>$B$12,$B$12<>-1)),O97+(N98-O97)*$O$74,O97+(L98-O97)*$O$74)","v":0},0,0,0,0,0,0,0,0,0,0,0,0]
[1,0.23000000000000007,0.72182360397697987,0.65,2.2844999997655671,2.2994999999999997,2.2614999997679264,2.2764999999999991,{"$f":"IF($B$7=constants!$C$60,G99,IF($B$8=constants!$C$60,C99,E99))","v":2.2844999997655671},{"$f":"IF($B$7=constants!$C$60,H99,IF($B$8=constants!$C$60,D99,F99))","v":2.2994999999999997},1,0,0,0,{"$f":"IF(OR($B$22=constants!$B$60,AND(I99>$B$12,$B$12<>-1)),O98+(N99-O98)*$O$74,O98+(L99-O98)*$O$74)","v":0},0,0,0,0,0,0,0,0,0,0,0,0]
[1,0.24000000000000007,0.74235511819541411,0.65,2.2844999999137565,2.2994999999999997,2.260499999914662,2.2754999999999992,{"$f":"IF($B$7=constants!$C$60,G100,IF($B$8=constants!$C$60,C100,E100))","v":2.2844999999137565},{"$f":"IF($B$7=constants!$C$60,H100,IF($B$8=constants!$C$60,D100,F100))","v":2.2994999999999997},1,0,0,0,{"$f":"IF(OR($B$22=constants!$B$60,AND(I100>$B$12,$B$12<>-1)),O99+(N100-O99)*$O$74,O99+(L100-O99)*$O$74)","v":0},0,0,0,0,0,0,0,0,0,0,0,0]
[1,0.25000000000000006,0.76221352931475905,0.65,2.2844999999682725,2.2994999999999997,2.2594999999686194,2.2744999999999993,{"$f":"IF($B$7=constants!$C$60,G101,IF($B$8=constants!$C$60,C101,E101))","v":2.2844999999682725},{"$f":"IF($B$7=constants!$C$60,H101,IF($B$8=constants!$C$60,D101,F101))","v":2.2994999999999997},1,0,0,0,{"$f":"IF(OR($B$22=constants!$B$60,AND(I101>$B$12,$B$12<>-1)),O100+(N101-O100)*$O$74,O100+(L101-O100)*$O$74)","v":0},0,0,0,0,0,0,0,0,0,0,0,0]
[1,0.26000000000000006,0.78142090427938027,0.65,2.2844999999883275,2.2994999999999997,2.2584999999884601,2.273499999999999,{"$f":"IF($B$7=constants!$C$60,G102,IF($B$8=constants!$C$60,C102,E102))","v":2.2844999999883275},{"$f":"IF($B$7=constants!$C$60,H102,IF($B$8=constants!$C$60,D102,F102))","v":2.2994999999999997},1,0,0,0,{"$f":"IF(OR($B$22=constants!$B$60,AND(I102>$B$12,$B$12<>-1)),O101+(N102-O101)*$O$74,O101+(L102-O101)*$O$74)","v":0},0,0,0,0,0,0,0,0,0,0,0,0]
[1,0.27000000000000007,0.79999858659315692,0.65,2.2844999999957056,2.2994999999999997,2.2574999999957561,2.2724999999999991,{"$f":"IF($B$7=constants!$C$60,G103,IF($B$8=constants!$C$60,C103,E103))","v":2.2844999999957056},{"$f":"IF($B$7=constants!$C$60,H103,IF($B$8=constants!$C$60,D103,F103))","v":2.2994999999999997},1,0,0,0,{"$f":"IF(OR($B$22=constants!$B$60,AND(I103>$B$12,$B$12<>-1)),O102+(N103-O102)*$O$74,O102+(L103-O102)*$O$74)","v":0},0,0,0,0,0,0,0,0,0,0,0,0]
[1,0.28000000000000008,0.81796722003668154,0.65,2.2844999999984199,2.2994999999999997,2.256499999998439,2.2714999999999992,{"$f":"IF($B$7=constants!$C$60,G104,IF($B$8=constants!$C$60,C104,E104))","v":2.2844999999984199},{"$f":"IF($B$7=constants!$C$60,H104,IF($B$8=constants!$C$60,D104,F104))","v":2.2994999999999997},1,0,0,0,{"$f":"IF(OR($B$22=constants!$B$60,AND(I104>$B$12,$B$12<>-1)),O103+(N104-O103)*$O$74,O103+(L104-O103)*$O$74)","v":0},0,0,0,0,0,0,0,0,0,0,0,0]
[1,0.29000000000000009,0.83534677160691795,0.65,2.2844999999994187,2.2994999999999997,2.2554999999994254,2.2704999999999993,{"$f":"IF($B$7=constants!$C$60,G105,IF($B$8=constants!$C$60,C105,E105))","v":2.2844999999994187},{"$f":"IF($B$7=constants!$C$60,H105,IF($B$8=constants!$C$60,D105,F105))","v":2.2994999999999997},1,0,0,0,{"$f":"IF(OR($B$22=constants!$B$60,AND(I105>$B$12,$B$12<>-1)),O104+(N105-O104)*$O$74,O104+(L105-O104)*$O$74)","v":0},0,0,0,0,0,0,0,0,0,0,0,0]
[1,0.3000000000000001,0.85215655370480814,0.65,2.2844999999997859,2.2994999999999997,2.2544999999997879,2.269499999999999,{"$f":"IF($B$7=constants!$C$60,G106,IF($B$8=constants!$C$60,C106,E106))","v":2.2844999999997859},{"$f":"IF($B$7=constants!$C$60,H106,IF($B$8=constants!$C$60,D106,F106))","v":2.2994999999999997},1,0,0,0,{"$f":"IF(OR($B$22=constants!$B$60,AND(I106>$B$12,$B$12<>-1)),O105+(N106-O105)*$O$74,O105+(L106-O105)*$O$74)","v":0},0,0,0,0,0,0,0,0,0,0,0,0]
[1,0.31000000000000011,0.86841524559548144,0.65,2.2844999999999209,2.2994999999999997,2.2534999999999212,2.2684999999999991,{"$f":"IF($B$7=constants!$C$60,G107,IF($B$8=constants!$C$60,C107,E107))","v":2.2844999999999209},{"$f":"IF($B$7=constants!$C$60,H107,IF($B$8=constants!$C$60,D107,F107))","v":2.2994999999999997},1,0,0,0,{"$f":"IF(OR($B$22=constants!$B$60,AND(I107>$B$12,$B$12<>-1)),O106+(N107-O106)*$O$74,O106+(L107-O106)*$O$74)","v":0},0,0,0,0,0,0,0,0,0,0,0,0]
[1,0.32000000000000012,0.88414091416491691,0.65,{"$f":"($F$76-$F$74)/(1-EXP(-1/E$74))*(1-EXP(-$B108/E$74))","v":2.2844999999999707},2.2994999999999997,{"$f":"(H108-$H$74)/(1-EXP(-1/G$74))*(1-EXP(-$B108/G$74))","v":2.2524999999999706},2.2674999999999992,{"$f":"IF($B$7=constants!$C$60,G108,IF($B$8=constants!$C$60,C108,E108))","v":2.2844999999999707},{"$f":"IF($B$7=constants!$C$60,H108,IF($B$8=constants!$C$60,D108,F108))","v":2.2994999999999997},1,0,0,0,{"$f":"IF(OR($B$22=constants!$B$60,AND(I108>$B$12,$B$12<>-1)),O107+(N108-O107)*$O$74,O107+(L108-O107)*$O$74)","v":0},0,0,0,0,0,0,0,0,0,0,0,0]
[1,0.33000000000000013,{"$f":"$B$18/(1-EXP(-1/$C$74))*(1-EXP(-B109/$C$74))","v":0.89935103399611893},0.65,2.2844999999999889,2.2994999999999997,2.2514999999999885,{"$f":"$H$68*B109+$H$69","v":2.2664999999999993},{"$f":"IF($B$7=constants!$C$60,G109,IF($B$8=constants!$C$60,C109,E109))","v":2.2844999999999889},{"$f":"IF($B$7=constants!$C$60,H109,IF($B$8=constants!$C$60,D109,F109))","v":2.2994999999999997},1,0,0,0,{"$f":"IF(OR($B$22=constants!$B$60,AND(I109>$B$12,$B$12<>-1)),O108+(N109-O108)*$O$74,O108+(L109-O108)*$O$74)","v":0},0,0,0,0,0,0,0,0,0,0,0,0]
[1,0.34000000000000014,0.91406250678711809,0.65,2.2844999999999955,2.2994999999999997,2.2504999999999953,2.265499999999999,{"$f":"IF($B$7=constants!$C$60,G110,IF($B$8=constants!$C$60,C110,E110))","v":2.2844999999999955},{"$f":"IF($B$7=constants!$C$60,H110,IF($B$8=constants!$C$60,D110,F110))","v":2.2994999999999997},1,0,0,0,{"$f":"IF(OR($B$22=constants!$B$60,AND(I110>$B$12,$B$12<>-1)),O109+(N110-O109)*$O$74,O109+(L110-O109)*$O$74)","v":0},0,0,0,0,0,0,0,0,0,0,0,0]
[1,0.35000000000000014,0.9282916801323754,0.65,2.2844999999999982,2.2994999999999997,2.2494999999999976,2.2644999999999991,{"$f":"IF($B$7=constants!$C$60,G111,IF($B$8=constants!$C$60,C111,E111))","v":2.2844999999999982},{"$f":"IF($B$7=constants!$C$60,H111,IF($B$8=constants!$C$60,D111,F111))","v":2.2994999999999997},1,0,0,0,{"$f":"IF(OR($B$22=constants!$B$60,AND(I111>$B$12,$B$12<>-1)),O110+(N111-O110)*$O$74,O110+(L111-O110)*$O$74)","v":0},0,0,0,0,0,0,0,0,0,0,0,0]
[1,0.36000000000000015,0.94205436568845757,0.65,2.2844999999999991,2.2994999999999997,2.2484999999999986,2.2634999999999992,{"$f":"IF($B$7=constants!$C$60,G112,IF($B$8=constants!$C$60,C112,E112))","v":2.2844999999999991},{"$f":"IF($B$7=constants!$C$60,H112,IF($B$8=constants!$C$60,D112,F112))","v":2.2994999999999997},1,0,0,0,{"$f":"IF(OR($B$22=constants!$B$60,AND(I112>$B$12,$B$12<>-1)),O111+(N112-O111)*$O$74,O111+(L112-O111)*$O$74)","v":0},0,0,0,0,0,0,0,0,0,0,0,0]
[1,0.37000000000000016,0.95536585674417152,0.65,2.2844999999999991,2.2994999999999997,2.2474999999999987,2.2624999999999993,{"$f":"IF($B$7=constants!$C$60,G113,IF($B$8=constants!$C$60,C113,E113))","v":2.2844999999999991},{"$f":"IF($B$7=constants!$C$60,H113,IF($B$8=constants!$C$60,D113,F113))","v":2.2994999999999997},1,0,0,0,{"$f":"IF(OR($B$22=constants!$B$60,AND(I113>$B$12,$B$12<>-1)),O112+(N113-O112)*$O$74,O112+(L113-O112)*$O$74)","v":0},0,0,0,0,0,0,0,0,0,0,0,0]
[1,0.38000000000000017,0.9682409452146804,0.65,2.2844999999999995,2.2994999999999997,2.2464999999999988,2.261499999999999,{"$f":"IF($B$7=constants!$C$60,G114,IF($B$8=constants!$C$60,C114,E114))","v":2.2844999999999995},{"$f":"IF($B$7=constants!$C$60,H114,IF($B$8=constants!$C$60,D114,F114))","v":2.2994999999999997},1,0,0,0,{"$f":"IF(OR($B$22=constants!$B$60,AND(I114>$B$12,$B$12<>-1)),O113+(N114-O113)*$O$74,O113+(L114-O113)*$O$74)","v":0},0,0,0,0,0,0,0,0,0,0,0,0]
[1,0.39000000000000018,0.98069393807848659,0.65,2.2844999999999995,2.2994999999999997,2.2454999999999989,2.2604999999999991,{"$f":"IF($B$7=constants!$C$60,G115,IF($B$8=constants!$C$60,C115,E115))","v":2.2844999999999995},{"$f":"IF($B$7=constants!$C$60,H115,IF($B$8=constants!$C$60,D115,F115))","v":2.2994999999999997},1,0,0,0,{"$f":"IF(OR($B$22=constants!$B$60,AND(I115>$B$12,$B$12<>-1)),O114+(N115-O114)*$O$74,O114+(L115-O114)*$O$74)","v":0},0,0,0,0,0,0,0,0,0,0,0,0]
[1,0.40000000000000019,0.99273867327554755,0.65,2.2844999999999995,2.2994999999999997,2.2444999999999991,2.2594999999999992,{"$f":"IF($B$7=constants!$C$60,G116,IF($B$8=constants!$C$60,C116,E116))","v":2.2844999999999995},{"$f":"IF($B$7=constants!$C$60,H116,IF($B$8=constants!$C$60,D116,F116))","v":2.2994999999999997},1,0,0,0,{"$f":"IF(OR($B$22=constants!$B$60,AND(I116>$B$12,$B$12<>-1)),O115+(N116-O115)*$O$74,O115+(L116-O115)*$O$74)","v":0},0,0,0,0,0,0,0,0,0,0,0,0]
[1,0.4100000000000002,1.0043885350841872,0.65,2.2844999999999995,2.2994999999999997,2.2434999999999992,2.2584999999999993,{"$f":"IF($B$7=constants!$C$60,G117,IF($B$8=constants!$C$60,C117,E117))","v":2.2844999999999995},{"$f":"IF($B$7=constants!$C$60,H117,IF($B$8=constants!$C$60,D117,F117))","v":2.2994999999999997},1,0,0,0,{"$f":"IF(OR($B$22=constants!$B$60,AND(I117>$B$12,$B$12<>-1)),O116+(N117-O116)*$O$74,O116+(L117-O116)*$O$74)","v":0},0,0,0,0,0,0,0,0,0,0,0,0]
[1,0.42000000000000021,1.0156564689938941,0.65,2.2844999999999995,{"$f":"F117","v":2.2994999999999997},2.2424999999999988,2.257499999999999,{"$f":"IF($B$7=constants!$C$60,G118,IF($B$8=constants!$C$60,C118,E118))","v":2.2844999999999995},{"$f":"IF($B$7=constants!$C$60,H118,IF($B$8=constants!$C$60,D118,F118))","v":2.2994999999999997},1,0,0,0,{"$f":"IF(OR($B$22=constants!$B$60,AND(I118>$B$12,$B$12<>-1)),O117+(N118-O117)*$O$74,O117+(L118-O117)*$O$74)","v":0},0,0,0,0,0,0,0,0,0,0,0,0]
[1,0.43000000000000022,1.0265549960905294,0.65,2.2844999999999995,2.2994999999999997,2.2414999999999989,2.2564999999999991,{"$f":"IF($B$7=constants!$C$60,G119,IF($B$8=constants!$C$60,C119,E119))","v":2.2844999999999995},{"$f":"IF($B$7=constants!$C$60,H119,IF($B$8=constants!$C$60,D119,F119))","v":2.2994999999999997},1,0,0,0,{"$f":"IF(OR($B$22=constants!$B$60,AND(I119>$B$12,$B$12<>-1)),O118+(N119-O118)*$O$74,O118+(L119-O118)*$O$74)","v":0},0,0,0,0,0,0,0,0,0,0,0,0]
[1,0.44000000000000022,1.0370962269699346,0.65,2.2844999999999995,2.2994999999999997,2.240499999999999,2.2554999999999992,{"$f":"IF($B$7=constants!$C$60,G120,IF($B$8=constants!$C$60,C120,E120))","v":2.2844999999999995},{"$f":"IF($B$7=constants!$C$60,H120,IF($B$8=constants!$C$60,D120,F120))","v":2.2994999999999997},1,0,0,0,{"$f":"IF(OR($B$22=constants!$B$60,AND(I120>$B$12,$B$12<>-1)),O119+(N120-O119)*$O$74,O119+(L120-O119)*$O$74)","v":0},0,0,0,0,0,0,0,0,0,0,0,0]
[1,0.45000000000000023,1.0472918751953935,0.65,2.2844999999999995,2.2994999999999997,2.2394999999999992,2.2544999999999993,{"$f":"IF($B$7=constants!$C$60,G121,IF($B$8=constants!$C$60,C121,E121))","v":2.2844999999999995},{"$f":"IF($B$7=constants!$C$60,H121,IF($B$8=constants!$C$60,D121,F121))","v":2.2994999999999997},1,0,0,0,{"$f":"IF(OR($B$22=constants!$B$60,AND(I121>$B$12,$B$12<>-1)),O120+(N121-O120)*$O$74,O120+(L121-O120)*$O$74)","v":0},0,0,0,0,0,0,0,0,0,0,0,0]
[1,0.46000000000000024,1.0571532703139082,0.65,2.2844999999999995,2.2994999999999997,2.2384999999999988,2.2534999999999989,{"$f":"IF($B$7=constants!$C$60,G122,IF($B$8=constants!$C$60,C122,E122))","v":2.2844999999999995},{"$f":"IF($B$7=constants!$C$60,H122,IF($B$8=constants!$C$60,D122,F122))","v":2.2994999999999997},1,0,0,0,{"$f":"IF(OR($B$22=constants!$B$60,AND(I122>$B$12,$B$12<>-1)),O121+(N122-O121)*$O$74,O121+(L122-O121)*$O$74)","v":0},0,0,0,0,0,0,0,0,0,0,0,0]
[1,0.47000000000000025,1.0666913704457499,0.65,2.2844999999999995,2.2994999999999997,2.2374999999999989,2.2524999999999991,{"$f":"IF($B$7=constants!$C$60,G123,IF($B$8=constants!$C$60,C123,E123))","v":2.2844999999999995},{"$f":"IF($B$7=constants!$C$60,H123,IF($B$8=constants!$C$60,D123,F123))","v":2.2994999999999997},1,0,0,0,{"$f":"IF(OR($B$22=constants!$B$60,AND(I123>$B$12,$B$12<>-1)),O122+(N123-O122)*$O$74,O122+(L123-O122)*$O$74)","v":0},0,0,0,0,0,0,0,0,0,0,0,0]
[1,0.48000000000000026,1.0759167744612772,0.65,2.2844999999999995,2.2994999999999997,2.236499999999999,2.2514999999999992,{"$f":"IF($B$7=constants!$C$60,G124,IF($B$8=constants!$C$60,C124,E124))","v":2.2844999999999995},{"$f":"IF($B$7=constants!$C$60,H124,IF($B$8=constants!$C$60,D124,F124))","v":2.2994999999999997},1,0,0,0,{"$f":"IF(OR($B$22=constants!$B$60,AND(I124>$B$12,$B$12<>-1)),O123+(N124-O123)*$O$74,O123+(L124-O123)*$O$74)","v":0},0,0,0,0,0,0,0,0,0,0,0,0]
[1,0.49000000000000027,1.0848397337585463,0.65,2.2844999999999995,2.2994999999999997,2.2354999999999992,2.2504999999999993,{"$f":"IF($B$7=constants!$C$60,G125,IF($B$8=constants!$C$60,C125,E125))","v":2.2844999999999995},{"$f":"IF($B$7=constants!$C$60,H125,IF($B$8=constants!$C$60,D125,F125))","v":2.2994999999999997},1,0,0,0,{"$f":"IF(OR($B$22=constants!$B$60,AND(I125>$B$12,$B$12<>-1)),O124+(N125-O124)*$O$74,O124+(L125-O124)*$O$74)","v":0},0,0,0,0,0,0,0,0,0,0,0,0]
[1,0.50000000000000022,1.0934701636548105,0.65,2.2844999999999995,2.2994999999999997,2.2344999999999988,2.2494999999999989,{"$f":"IF($B$7=constants!$C$60,G126,IF($B$8=constants!$C$60,C126,E126))","v":2.2844999999999995},{"$f":"IF($B$7=constants!$C$60,H126,IF($B$8=constants!$C$60,D126,F126))","v":2.2994999999999997},1,0,0,0,{"$f":"IF(OR($B$22=constants!$B$60,AND(I126>$B$12,$B$12<>-1)),O125+(N126-O125)*$O$74,O125+(L126-O125)*$O$74)","v":0},0,0,0,0,0,0,0,0,0,0,0,0]
[1,0.51000000000000023,1.1018176544045588,0.65,2.2844999999999995,2.2994999999999997,2.2334999999999989,2.2484999999999991,{"$f":"IF($B$7=constants!$C$60,G127,IF($B$8=constants!$C$60,C127,E127))","v":2.2844999999999995},{"$f":"IF($B$7=constants!$C$60,H127,IF($B$8=constants!$C$60,D127,F127))","v":2.2994999999999997},1,0,0,0,{"$f":"IF(OR($B$22=constants!$B$60,AND(I127>$B$12,$B$12<>-1)),O126+(N127-O126)*$O$74,O126+(L127-O126)*$O$74)","v":0},0,0,0,0,0,0,0,0,0,0,0,0]
[1,0.52000000000000024,1.1098914818563397,0.65,2.2844999999999995,2.2994999999999997,2.232499999999999,2.2474999999999992,{"$f":"IF($B$7=constants!$C$60,G128,IF($B$8=constants!$C$60,C128,E128))","v":2.2844999999999995},{"$f":"IF($B$7=constants!$C$60,H128,IF($B$8=constants!$C$60,D128,F128))","v":2.2994999999999997},1,0,0,0,{"$f":"IF(OR($B$22=constants!$B$60,AND(I128>$B$12,$B$12<>-1)),O127+(N128-O127)*$O$74,O127+(L128-O127)*$O$74)","v":0},0,0,0,0,0,0,0,0,0,0,0,0]
[1,0.53000000000000025,1.1177006177602158,0.65,2.2844999999999995,2.2994999999999997,2.2314999999999992,2.2464999999999993,{"$f":"IF($B$7=constants!$C$60,G129,IF($B$8=constants!$C$60,C129,E129))","v":2.2844999999999995},{"$f":"IF($B$7=constants!$C$60,H129,IF($B$8=constants!$C$60,D129,F129))","v":2.2994999999999997},1,0,0,0,{"$f":"IF(OR($B$22=constants!$B$60,AND(I129>$B$12,$B$12<>-1)),O128+(N129-O128)*$O$74,O128+(L129-O128)*$O$74)","v":0},0,0,0,0,0,0,0,0,0,0,0,0]
[1,0.54000000000000026,1.1252537397372968,0.65,2.2844999999999995,2.2994999999999997,2.2304999999999988,2.2454999999999989,{"$f":"IF($B$7=constants!$C$60,G130,IF($B$8=constants!$C$60,C130,E130))","v":2.2844999999999995},{"$f":"IF($B$7=constants!$C$60,H130,IF($B$8=constants!$C$60,D130,F130))","v":2.2994999999999997},1,0,0,0,{"$f":"IF(OR($B$22=constants!$B$60,AND(I130>$B$12,$B$12<>-1)),O129+(N130-O129)*$O$74,O129+(L130-O129)*$O$74)","v":0},0,0,0,0,0,0,0,0,0,0,0,0]
[1,0.55000000000000027,1.1325592409224345,0.65,2.2844999999999995,2.2994999999999997,2.2294999999999989,2.2444999999999991,{"$f":"IF($B$7=constants!$C$60,G131,IF($B$8=constants!$C$60,C131,E131))","v":2.2844999999999995},{"$f":"IF($B$7=constants!$C$60,H131,IF($B$8=constants!$C$60,D131,F131))","v":2.2994999999999997},1,0,0,0,{"$f":"IF(OR($B$22=constants!$B$60,AND(I131>$B$12,$B$12<>-1)),O130+(N131-O130)*$O$74,O130+(L131-O130)*$O$74)","v":0},0,0,0,0,0,0,0,0,0,0,0,0]
[1,0.56000000000000028,1.1396252392907895,0.65,2.2844999999999995,2.2994999999999997,2.228499999999999,2.2434999999999992,{"$f":"IF($B$7=constants!$C$60,G132,IF($B$8=constants!$C$60,C132,E132))","v":2.2844999999999995},{"$f":"IF($B$7=constants!$C$60,H132,IF($B$8=constants!$C$60,D132,F132))","v":2.2994999999999997},1,0,0,0,{"$f":"IF(OR($B$22=constants!$B$60,AND(I132>$B$12,$B$12<>-1)),O131+(N132-O131)*$O$74,O131+(L132-O131)*$O$74)","v":0},0,0,0,0,0,0,0,0,0,0,0,0]
[1,0.57000000000000028,1.1464595866786425,0.65,2.2844999999999995,2.2994999999999997,2.2274999999999991,2.2424999999999993,{"$f":"IF($B$7=constants!$C$60,G133,IF($B$8=constants!$C$60,C133,E133))","v":2.2844999999999995},{"$f":"IF($B$7=constants!$C$60,H133,IF($B$8=constants!$C$60,D133,F133))","v":2.2994999999999997},1,0,0,0,{"$f":"IF(OR($B$22=constants!$B$60,AND(I133>$B$12,$B$12<>-1)),O132+(N133-O132)*$O$74,O132+(L133-O132)*$O$74)","v":0},0,0,0,0,0,0,0,0,0,0,0,0]
[1,0.58000000000000029,1.1530698775084607,0.65,2.2844999999999995,2.2994999999999997,2.2264999999999988,2.2414999999999989,{"$f":"IF($B$7=constants!$C$60,G134,IF($B$8=constants!$C$60,C134,E134))","v":2.2844999999999995},{"$f":"IF($B$7=constants!$C$60,H134,IF($B$8=constants!$C$60,D134,F134))","v":2.2994999999999997},1,0,0,0,{"$f":"IF(OR($B$22=constants!$B$60,AND(I134>$B$12,$B$12<>-1)),O133+(N134-O133)*$O$74,O133+(L134-O133)*$O$74)","v":0},0,0,0,0,0,0,0,0,0,0,0,0]
[1,0.5900000000000003,1.1594634572279294,0.65,2.2844999999999995,2.2994999999999997,2.2254999999999989,2.240499999999999,{"$f":"IF($B$7=constants!$C$60,G135,IF($B$8=constants!$C$60,C135,E135))","v":2.2844999999999995},{"$f":"IF($B$7=constants!$C$60,H135,IF($B$8=constants!$C$60,D135,F135))","v":2.2994999999999997},1,0,0,0,{"$f":"IF(OR($B$22=constants!$B$60,AND(I135>$B$12,$B$12<>-1)),O134+(N135-O134)*$O$74,O134+(L135-O134)*$O$74)","v":0},0,0,0,0,0,0,0,0,0,0,0,0]
[1,0.60000000000000031,1.165647430472315,0.65,2.2844999999999995,2.2994999999999997,2.224499999999999,2.2394999999999992,{"$f":"IF($B$7=constants!$C$60,G136,IF($B$8=constants!$C$60,C136,E136))","v":2.2844999999999995},{"$f":"IF($B$7=constants!$C$60,H136,IF($B$8=constants!$C$60,D136,F136))","v":2.2994999999999997},1,0,0,0,{"$f":"IF(OR($B$22=constants!$B$60,AND(I136>$B$12,$B$12<>-1)),O135+(N136-O135)*$O$74,O135+(L136-O135)*$O$74)","v":0},0,0,0,0,0,0,0,0,0,0,0,0]
[1,0.61000000000000032,1.1716286689592346,0.65,2.2844999999999995,2.2994999999999997,2.2234999999999991,2.2384999999999993,{"$f":"IF($B$7=constants!$C$60,G137,IF($B$8=constants!$C$60,C137,E137))","v":2.2844999999999995},{"$f":"IF($B$7=constants!$C$60,H137,IF($B$8=constants!$C$60,D137,F137))","v":2.2994999999999997},1,0,0,0,{"$f":"IF(OR($B$22=constants!$B$60,AND(I137>$B$12,$B$12<>-1)),O136+(N137-O136)*$O$74,O136+(L137-O136)*$O$74)","v":0},0,0,0,0,0,0,0,0,0,0,0,0]
[1,0.62000000000000033,1.177413819124606,0.65,2.2844999999999995,2.2994999999999997,2.2224999999999988,2.2374999999999989,{"$f":"IF($B$7=constants!$C$60,G138,IF($B$8=constants!$C$60,C138,E138))","v":2.2844999999999995},{"$f":"IF($B$7=constants!$C$60,H138,IF($B$8=constants!$C$60,D138,F138))","v":2.2994999999999997},1,0,0,0,{"$f":"IF(OR($B$22=constants!$B$60,AND(I138>$B$12,$B$12<>-1)),O137+(N138-O137)*$O$74,O137+(L138-O137)*$O$74)","v":0},0,0,0,0,0,0,0,0,0,0,0,0]
[1,0.63000000000000034,1.183009309508259,0.65,2.2844999999999995,2.2994999999999997,2.2214999999999989,2.236499999999999,{"$f":"IF($B$7=constants!$C$60,G139,IF($B$8=constants!$C$60,C139,E139))","v":2.2844999999999995},{"$f":"IF($B$7=constants!$C$60,H139,IF($B$8=constants!$C$60,D139,F139))","v":2.2994999999999997},1,0,0,0,{"$f":"IF(OR($B$22=constants!$B$60,AND(I139>$B$12,$B$12<>-1)),O138+(N139-O138)*$O$74,O138+(L139-O138)*$O$74)","v":0},0,0,0,0,0,0,0,0,0,0,0,0]
[1,0.64000000000000035,1.1884213578974208,0.65,{"$f":"($F$76-$F$74)/(1-EXP(-1/E$74))*(1-EXP(-$B140/E$74))","v":2.2844999999999995},2.2994999999999997,{"$f":"(H140-$H$74)/(1-EXP(-1/G$74))*(1-EXP(-$B140/G$74))","v":2.220499999999999},2.2354999999999992,{"$f":"IF($B$7=constants!$C$60,G140,IF($B$8=constants!$C$60,C140,E140))","v":2.2844999999999995},{"$f":"IF($B$7=constants!$C$60,H140,IF($B$8=constants!$C$60,D140,F140))","v":2.2994999999999997},1,0,0,0,{"$f":"IF(OR($B$22=constants!$B$60,AND(I140>$B$12,$B$12<>-1)),O139+(N140-O139)*$O$74,O139+(L140-O139)*$O$74)","v":0},0,0,0,0,0,0,0,0,0,0,0,0]
[{"$f":"IF(B141<=100,1,IF(B141<=200,2,3))","v":1},0.65000000000000036,{"$f":"$B$18/(1-EXP(-1/$C$74))*(1-EXP(-B141/$C$74))","v":1.1936559782360057},0.65,2.2844999999999995,2.2994999999999997,2.2194999999999991,{"$f":"$H$68*B141+$H$69","v":2.2344999999999993},{"$f":"IF($B$7=constants!$C$60,G141,IF($B$8=constants!$C$60,C141,E141))","v":2.2844999999999995},{"$f":"IF($B$7=constants!$C$60,H141,IF($B$8=constants!$C$60,D141,F141))","v":2.2994999999999997},1,0,0,{"$f":"IF(M141>I141,L141,M141)","v":0},{"$f":"IF(OR($B$22=constants!$B$60,AND(I141>$B$12,$B$12<>-1)),O140+(N141-O140)*$O$74,O140+(L141-O140)*$O$74)","v":0},{"$f":"IF(O141=0,0,O141-$P$72)","v":0},0,0,{"$f":"S$72*IF(S$71=0,$L141,IF(S$71=1,$R141,IF($B$12=-1,$L141,IF($I141>$B$12,$R141,$L141))))","v":0},0,0,0,0,0,{"$f":"IF(V141=0,0,V141-Y$72)","v":0},{"$f":"IF(W141=0,0,W141-Z$72)","v":0},{"$f":"IF(X141=0,0,X141-AA$72)","v":0}]
[1,{"$f":"B141+0.01","v":0.66000000000000036},1.1987189873073956,{"$f":"D141","v":0.65},2.2844999999999995,2.2994999999999997,2.2184999999999988,2.2334999999999989,{"$f":"IF($B$7=constants!$C$60,G142,IF($B$8=constants!$C$60,C142,E142))","v":2.2844999999999995},{"$f":"IF($B$7=constants!$C$60,H142,IF($B$8=constants!$C$60,D142,F142))","v":2.2994999999999997},{"$f":"IF(AND(I142>$B$16,K141=0),1,IF(AND(I142<$B$17,K141=1),0,K141))","v":1},0,0,0,{"$f":"IF(OR($B$22=constants!$B$60,AND(I142>$B$12,$B$12<>-1)),O141+(N142-O141)*$O$74,O141+(L142-O141)*$O$74)","v":0},0,0,{"$f":"IF(Q142>I142,I142,Q142)","v":0},0,0,0,{"$f":"V141+(S142-V$72-V141)*V$74","v":0},{"$f":"W141+(T142-W$72-W141)*W$74","v":0},{"$f":"X141+(U142-X$72-X141)*X$74","v":0},0,0,0]
[1,0.67000000000000037,1.20361601119813,0.65,2.2844999999999995,2.2994999999999997,2.2174999999999989,2.232499999999999,{"$f":"IF($B$7=constants!$C$60,G143,IF($B$8=constants!$C$60,C143,E143))","v":2.2844999999999995},{"$f":"IF($B$7=constants!$C$60,H143,IF($B$8=constants!$C$60,D143,F143))","v":2.2994999999999997},1,0,0,0,{"$f":"IF(OR($B$22=constants!$B$60,AND(I143>$B$12,$B$12<>-1)),O142+(N143-O142)*$O$74,O142+(L143-O142)*$O$74)","v":0},0,0,0,0,0,0,0,0,0,0,0,0]
[1,0.68000000000000038,1.2083524915496937,0.65,2.2844999999999995,2.2994999999999997,2.216499999999999,2.2314999999999992,{"$f":"IF($B$7=constants!$C$60,G144,IF($B$8=constants!$C$60,C144,E144))","v":2.2844999999999995},{"$f":"IF($B$7=constants!$C$60,H144,IF($B$8=constants!$C$60,D144,F144))","v":2.2994999999999997},1,0,0,0,{"$f":"IF(OR($B$22=constants!$B$60,AND(I144>$B$12,$B$12<>-1)),O143+(N144-O143)*$O$74,O143+(L144-O143)*$O$74)","v":0},0,0,0,0,0,0,0,0,0,0,0,0]
[1,0.69000000000000039,1.2129336916053428,0.65,2.2844999999999995,2.2994999999999997,2.2154999999999991,2.2304999999999993,{"$f":"IF($B$7=constants!$C$60,G145,IF($B$8=constants!$C$60,C145,E145))","v":2.2844999999999995},{"$f":"IF($B$7=constants!$C$60,H145,IF($B$8=constants!$C$60,D145,F145))","v":2.2994999999999997},1,0,0,0,{"$f":"IF(OR($B$22=constants!$B$60,AND(I145>$B$12,$B$12<>-1)),O144+(N145-O144)*$O$74,O144+(L145-O144)*$O$74)","v":0},0,0,0,0,0,0,0,0,0,0,0,0]
[1,0.7000000000000004,1.2173647020586955,0.65,2.2844999999999995,2.2994999999999997,2.2144999999999988,2.2294999999999989,{"$f":"IF($B$7=constants!$C$60,G146,IF($B$8=constants!$C$60,C146,E146))","v":2.2844999999999995},{"$f":"IF($B$7=constants!$C$60,H146,IF($B$8=constants!$C$60,D146,F146))","v":2.2994999999999997},1,0,0,0,{"$f":"IF(OR($B$22=constants!$B$60,AND(I146>$B$12,$B$12<>-1)),O145+(N146-O145)*$O$74,O145+(L146-O145)*$O$74)","v":0},0,0,0,0,0,0,0,0,0,0,0,0]
[1,0.71000000000000041,1.2216504467105824,0.65,2.2844999999999995,2.2994999999999997,2.2134999999999989,2.228499999999999,{"$f":"IF($B$7=constants!$C$60,G147,IF($B$8=constants!$C$60,C147,E147))","v":2.2844999999999995},{"$f":"IF($B$7=constants!$C$60,H147,IF($B$8=constants!$C$60,D147,F147))","v":2.2994999999999997},1,0,0,0,{"$f":"IF(OR($B$22=constants!$B$60,AND(I147>$B$12,$B$12<>-1)),O146+(N147-O146)*$O$74,O146+(L147-O146)*$O$74)","v":0},0,0,0,0,0,0,0,0,0,0,0,0]
[1,0.72000000000000042,1.2257956879404421,0.65,2.2844999999999995,2.2994999999999997,2.212499999999999,2.2274999999999991,{"$f":"IF($B$7=constants!$C$60,G148,IF($B$8=constants!$C$60,C148,E148))","v":2.2844999999999995},{"$f":"IF($B$7=constants!$C$60,H148,IF($B$8=constants!$C$60,D148,F148))","v":2.2994999999999997},1,0,0,0,{"$f":"IF(OR($B$22=constants!$B$60,AND(I148>$B$12,$B$12<>-1)),O147+(N148-O147)*$O$74,O147+(L148-O147)*$O$74)","v":0},0,0,0,0,0,0,0,0,0,0,0,0]
[1,0.73000000000000043,1.229805031998344,0.65,2.2844999999999995,2.2994999999999997,2.2114999999999991,2.2264999999999993,{"$f":"IF($B$7=constants!$C$60,G149,IF($B$8=constants!$C$60,C149,E149))","v":2.2844999999999995},{"$f":"IF($B$7=constants!$C$60,H149,IF($B$8=constants!$C$60,D149,F149))","v":2.2994999999999997},1,0,0,0,{"$f":"IF(OR($B$22=constants!$B$60,AND(I149>$B$12,$B$12<>-1)),O148+(N149-O148)*$O$74,O148+(L149-O148)*$O$74)","v":0},0,0,0,0,0,0,0,0,0,0,0,0]
[1,0.74000000000000044,1.2336829341235187,0.65,2.2844999999999995,2.2994999999999997,2.2104999999999988,2.2254999999999989,{"$f":"IF($B$7=constants!$C$60,G150,IF($B$8=constants!$C$60,C150,E150))","v":2.2844999999999995},{"$f":"IF($B$7=constants!$C$60,H150,IF($B$8=constants!$C$60,D150,F150))","v":2.2994999999999997},1,0,0,0,{"$f":"IF(OR($B$22=constants!$B$60,AND(I150>$B$12,$B$12<>-1)),O149+(N150-O149)*$O$74,O149+(L150-O149)*$O$74)","v":0},0,0,0,0,0,0,0,0,0,0,0,0]
[1,0.75000000000000044,1.2374337034950813,0.65,2.2844999999999995,2.2994999999999997,2.2094999999999989,2.224499999999999,{"$f":"IF($B$7=constants!$C$60,G151,IF($B$8=constants!$C$60,C151,E151))","v":2.2844999999999995},{"$f":"IF($B$7=constants!$C$60,H151,IF($B$8=constants!$C$60,D151,F151))","v":2.2994999999999997},1,0,0,0,{"$f":"IF(OR($B$22=constants!$B$60,AND(I151>$B$12,$B$12<>-1)),O150+(N151-O150)*$O$74,O150+(L151-O150)*$O$74)","v":0},0,0,0,0,0,0,0,0,0,0,0,0]
[1,0.76000000000000045,1.2410615080204512,0.65,2.2844999999999995,2.2994999999999997,2.208499999999999,2.2234999999999991,{"$f":"IF($B$7=constants!$C$60,G152,IF($B$8=constants!$C$60,C152,E152))","v":2.2844999999999995},{"$f":"IF($B$7=constants!$C$60,H152,IF($B$8=constants!$C$60,D152,F152))","v":2.2994999999999997},1,0,0,0,{"$f":"IF(OR($B$22=constants!$B$60,AND(I152>$B$12,$B$12<>-1)),O151+(N152-O151)*$O$74,O151+(L152-O151)*$O$74)","v":0},0,0,0,0,0,0,0,0,0,0,0,0]
[1,0.77000000000000046,1.2445703789667903,0.65,2.2844999999999995,2.2994999999999997,2.2074999999999991,2.2224999999999993,{"$f":"IF($B$7=constants!$C$60,G153,IF($B$8=constants!$C$60,C153,E153))","v":2.2844999999999995},{"$f":"IF($B$7=constants!$C$60,H153,IF($B$8=constants!$C$60,D153,F153))","v":2.2994999999999997},1,0,0,0,{"$f":"IF(OR($B$22=constants!$B$60,AND(I153>$B$12,$B$12<>-1)),O152+(N153-O152)*$O$74,O152+(L153-O152)*$O$74)","v":0},0,0,0,0,0,0,0,0,0,0,0,0]
[1,0.78000000000000047,1.2479642154406034,0.65,2.2844999999999995,2.2994999999999997,2.2064999999999988,2.2214999999999989,{"$f":"IF($B$7=constants!$C$60,G154,IF($B$8=constants!$C$60,C154,E154))","v":2.2844999999999995},{"$f":"IF($B$7=constants!$C$60,H154,IF($B$8=constants!$C$60,D154,F154))","v":2.2994999999999997},1,0,0,0,{"$f":"IF(OR($B$22=constants!$B$60,AND(I154>$B$12,$B$12<>-1)),O153+(N154-O153)*$O$74,O153+(L154-O153)*$O$74)","v":0},0,0,0,0,0,0,0,0,0,0,0,0]
[1,0.79000000000000048,1.2512467887204783,0.65,2.2844999999999995,2.2994999999999997,2.2054999999999989,2.220499999999999,{"$f":"IF($B$7=constants!$C$60,G155,IF($B$8=constants!$C$60,C155,E155))","v":2.2844999999999995},{"$f":"IF($B$7=constants!$C$60,H155,IF($B$8=constants!$C$60,D155,F155))","v":2.2994999999999997},1,0,0,0,{"$f":"IF(OR($B$22=constants!$B$60,AND(I155>$B$12,$B$12<>-1)),O154+(N155-O154)*$O$74,O154+(L155-O154)*$O$74)","v":0},0,0,0,0,0,0,0,0,0,0,0,0]
[1,0.80000000000000049,1.2544217464477854,0.65,2.2844999999999995,2.2994999999999997,2.204499999999999,2.2194999999999991,{"$f":"IF($B$7=constants!$C$60,G156,IF($B$8=constants!$C$60,C156,E156))","v":2.2844999999999995},{"$f":"IF($B$7=constants!$C$60,H156,IF($B$8=constants!$C$60,D156,F156))","v":2.2994999999999997},1,0,0,0,{"$f":"IF(OR($B$22=constants!$B$60,AND(I156>$B$12,$B$12<>-1)),O155+(N156-O155)*$O$74,O155+(L156-O155)*$O$74)","v":0},0,0,0,0,0,0,0,0,0,0,0,0]
[1,0.8100000000000005,1.2574926166799865,0.65,2.2844999999999995,2.2994999999999997,2.2034999999999991,2.2184999999999993,{"$f":"IF($B$7=constants!$C$60,G157,IF($B$8=constants!$C$60,C157,E157))","v":2.2844999999999995},{"$f":"IF($B$7=constants!$C$60,H157,IF($B$8=constants!$C$60,D157,F157))","v":2.2994999999999997},1,0,0,0,{"$f":"IF(OR($B$22=constants!$B$60,AND(I157>$B$12,$B$12<>-1)),O156+(N157-O156)*$O$74,O156+(L157-O156)*$O$74)","v":0},0,0,0,0,0,0,0,0,0,0,0,0]
[1,0.82000000000000051,1.2604628118110623,0.65,2.2844999999999995,2.2994999999999997,2.2024999999999988,2.2174999999999989,{"$f":"IF($B$7=constants!$C$60,G158,IF($B$8=constants!$C$60,C158,E158))","v":2.2844999999999995},{"$f":"IF($B$7=constants!$C$60,H158,IF($B$8=constants!$C$60,D158,F158))","v":2.2994999999999997},1,0,0,0,{"$f":"IF(OR($B$22=constants!$B$60,AND(I158>$B$12,$B$12<>-1)),O157+(N158-O157)*$O$74,O157+(L158-O157)*$O$74)","v":0},0,0,0,0,0,0,0,0,0,0,0,0]
[1,0.83000000000000052,1.2633356323634122,0.65,2.2844999999999995,2.2994999999999997,2.2014999999999989,2.216499999999999,{"$f":"IF($B$7=constants!$C$60,G159,IF($B$8=constants!$C$60,C159,E159))","v":2.2844999999999995},{"$f":"IF($B$7=constants!$C$60,H159,IF($B$8=constants!$C$60,D159,F159))","v":2.2994999999999997},1,0,0,0,{"$f":"IF(OR($B$22=constants!$B$60,AND(I159>$B$12,$B$12<>-1)),O158+(N159-O158)*$O$74,O158+(L159-O158)*$O$74)","v":0},0,0,0,0,0,0,0,0,0,0,0,0]
[1,0.84000000000000052,1.2661142706554405,0.65,2.2844999999999995,2.2994999999999997,2.200499999999999,2.2154999999999991,{"$f":"IF($B$7=constants!$C$60,G160,IF($B$8=constants!$C$60,C160,E160))","v":2.2844999999999995},{"$f":"IF($B$7=constants!$C$60,H160,IF($B$8=constants!$C$60,D160,F160))","v":2.2994999999999997},1,0,0,0,{"$f":"IF(OR($B$22=constants!$B$60,AND(I160>$B$12,$B$12<>-1)),O159+(N160-O159)*$O$74,O159+(L160-O159)*$O$74)","v":0},0,0,0,0,0,0,0,0,0,0,0,0]
[1,0.85000000000000053,1.2688018143489062,0.65,2.2844999999999995,2.2994999999999997,2.1994999999999991,2.2144999999999992,{"$f":"IF($B$7=constants!$C$60,G161,IF($B$8=constants!$C$60,C161,E161))","v":2.2844999999999995},{"$f":"IF($B$7=constants!$C$60,H161,IF($B$8=constants!$C$60,D161,F161))","v":2.2994999999999997},1,0,0,0,{"$f":"IF(OR($B$22=constants!$B$60,AND(I161>$B$12,$B$12<>-1)),O160+(N161-O160)*$O$74,O160+(L161-O160)*$O$74)","v":0},0,0,0,0,0,0,0,0,0,0,0,0]
[1,0.86000000000000054,1.2714012498799747,0.65,2.2844999999999995,2.2994999999999997,2.1984999999999988,2.2134999999999989,{"$f":"IF($B$7=constants!$C$60,G162,IF($B$8=constants!$C$60,C162,E162))","v":2.2844999999999995},{"$f":"IF($B$7=constants!$C$60,H162,IF($B$8=constants!$C$60,D162,F162))","v":2.2994999999999997},1,0,0,0,{"$f":"IF(OR($B$22=constants!$B$60,AND(I162>$B$12,$B$12<>-1)),O161+(N162-O161)*$O$74,O161+(L162-O161)*$O$74)","v":0},0,0,0,0,0,0,0,0,0,0,0,0]
[1,0.87000000000000055,1.2739154657777896,0.65,2.2844999999999995,2.2994999999999997,2.1974999999999989,2.212499999999999,{"$f":"IF($B$7=constants!$C$60,G163,IF($B$8=constants!$C$60,C163,E163))","v":2.2844999999999995},{"$f":"IF($B$7=constants!$C$60,H163,IF($B$8=constants!$C$60,D163,F163))","v":2.2994999999999997},1,0,0,0,{"$f":"IF(OR($B$22=constants!$B$60,AND(I163>$B$12,$B$12<>-1)),O162+(N163-O162)*$O$74,O162+(L163-O162)*$O$74)","v":0},0,0,0,0,0,0,0,0,0,0,0,0]
[1,0.88000000000000056,1.2763472558742439,0.65,2.2844999999999995,2.2994999999999997,2.196499999999999,2.2114999999999991,{"$f":"IF($B$7=constants!$C$60,G164,IF($B$8=constants!$C$60,C164,E164))","v":2.2844999999999995},{"$f":"IF($B$7=constants!$C$60,H164,IF($B$8=constants!$C$60,D164,F164))","v":2.2994999999999997},1,0,0,0,{"$f":"IF(OR($B$22=constants!$B$60,AND(I164>$B$12,$B$12<>-1)),O163+(N164-O163)*$O$74,O163+(L164-O163)*$O$74)","v":0},0,0,0,0,0,0,0,0,0,0,0,0]
[1,0.89000000000000057,1.2786993224085272,0.65,2.2844999999999995,2.2994999999999997,2.1954999999999991,2.2104999999999992,{"$f":"IF($B$7=constants!$C$60,G165,IF($B$8=constants!$C$60,C165,E165))","v":2.2844999999999995},{"$f":"IF($B$7=constants!$C$60,H165,IF($B$8=constants!$C$60,D165,F165))","v":2.2994999999999997},1,0,0,0,{"$f":"IF(OR($B$22=constants!$B$60,AND(I165>$B$12,$B$12<>-1)),O164+(N165-O164)*$O$74,O164+(L165-O164)*$O$74)","v":0},0,0,0,0,0,0,0,0,0,0,0,0]
[1,0.90000000000000058,1.2809742790298908,0.65,2.2844999999999995,2.2994999999999997,2.1944999999999988,2.2094999999999989,{"$f":"IF($B$7=constants!$C$60,G166,IF($B$8=constants!$C$60,C166,E166))","v":2.2844999999999995},{"$f":"IF($B$7=constants!$C$60,H166,IF($B$8=constants!$C$60,D166,F166))","v":2.2994999999999997},1,0,0,0,{"$f":"IF(OR($B$22=constants!$B$60,AND(I166>$B$12,$B$12<>-1)),O165+(N166-O165)*$O$74,O165+(L166-O165)*$O$74)","v":0},0,0,0,0,0,0,0,0,0,0,0,0]
[1,0.91000000000000059,1.2831746537019719,0.65,2.2844999999999995,2.2994999999999997,2.1934999999999989,2.208499999999999,{"$f":"IF($B$7=constants!$C$60,G167,IF($B$8=constants!$C$60,C167,E167))","v":2.2844999999999995},{"$f":"IF($B$7=constants!$C$60,H167,IF($B$8=constants!$C$60,D167,F167))","v":2.2994999999999997},1,0,0,0,{"$f":"IF(OR($B$22=constants!$B$60,AND(I167>$B$12,$B$12<>-1)),O166+(N167-O166)*$O$74,O166+(L167-O166)*$O$74)","v":0},0,0,0,0,0,0,0,0,0,0,0,0]
[1,0.9200000000000006,1.2853028915119016,0.65,2.2844999999999995,2.2994999999999997,2.192499999999999,2.2074999999999991,{"$f":"IF($B$7=constants!$C$60,G168,IF($B$8=constants!$C$60,C168,E168))","v":2.2844999999999995},{"$f":"IF($B$7=constants!$C$60,H168,IF($B$8=constants!$C$60,D168,F168))","v":2.2994999999999997},1,0,0,0,{"$f":"IF(OR($B$22=constants!$B$60,AND(I168>$B$12,$B$12<>-1)),O167+(N168-O167)*$O$74,O167+(L168-O167)*$O$74)","v":0},0,0,0,0,0,0,0,0,0,0,0,0]
[1,0.9300000000000006,1.2873613573873202,0.65,2.2844999999999995,2.2994999999999997,2.1914999999999991,2.2064999999999992,{"$f":"IF($B$7=constants!$C$60,G169,IF($B$8=constants!$C$60,C169,E169))","v":2.2844999999999995},{"$f":"IF($B$7=constants!$C$60,H169,IF($B$8=constants!$C$60,D169,F169))","v":2.2994999999999997},1,0,0,0,{"$f":"IF(OR($B$22=constants!$B$60,AND(I169>$B$12,$B$12<>-1)),O168+(N169-O168)*$O$74,O168+(L169-O168)*$O$74)","v":0},0,0,0,0,0,0,0,0,0,0,0,0]
[1,0.94000000000000061,1.2893523387243178,0.65,2.2844999999999995,2.2994999999999997,2.1904999999999988,2.2054999999999989,{"$f":"IF($B$7=constants!$C$60,G170,IF($B$8=constants!$C$60,C170,E170))","v":2.2844999999999995},{"$f":"IF($B$7=constants!$C$60,H170,IF($B$8=constants!$C$60,D170,F170))","v":2.2994999999999997},1,0,0,0,{"$f":"IF(OR($B$22=constants!$B$60,AND(I170>$B$12,$B$12<>-1)),O169+(N170-O169)*$O$74,O169+(L170-O169)*$O$74)","v":0},0,0,0,0,0,0,0,0,0,0,0,0]
[1,0.95000000000000062,1.291278047929221,0.65,2.2844999999999995,2.2994999999999997,2.1894999999999989,2.204499999999999,{"$f":"IF($B$7=constants!$C$60,G171,IF($B$8=constants!$C$60,C171,E171))","v":2.2844999999999995},{"$f":"IF($B$7=constants!$C$60,H171,IF($B$8=constants!$C$60,D171,F171))","v":2.2994999999999997},1,0,0,0,{"$f":"IF(OR($B$22=constants!$B$60,AND(I171>$B$12,$B$12<>-1)),O170+(N171-O170)*$O$74,O170+(L171-O170)*$O$74)","v":0},0,0,0,0,0,0,0,0,0,0,0,0]
[1,0.96000000000000063,1.2931406248770498,0.65,2.2844999999999995,2.2994999999999997,{"$f":"(H172-$H$74)/(1-EXP(-1/G$74))*(1-EXP(-$B172/G$74))","v":2.188499999999999},2.2034999999999991,{"$f":"IF($B$7=constants!$C$60,G172,IF($B$8=constants!$C$60,C172,E172))","v":2.2844999999999995},{"$f":"IF($B$7=constants!$C$60,H172,IF($B$8=constants!$C$60,D172,F172))","v":2.2994999999999997},1,0,0,0,{"$f":"IF(OR($B$22=constants!$B$60,AND(I172>$B$12,$B$12<>-1)),O171+(N172-O171)*$O$74,O171+(L172-O171)*$O$74)","v":0},0,0,0,0,0,0,0,0,0,0,0,0]
[1,0.97000000000000064,{"$f":"$B$18/(1-EXP(-1/$C$74))*(1-EXP(-B173/$C$74))","v":1.2949421392893765},0.65,2.2844999999999995,2.2994999999999997,2.1874999999999991,2.2024999999999992,{"$f":"IF($B$7=constants!$C$60,G173,IF($B$8=constants!$C$60,C173,E173))","v":2.2844999999999995},{"$f":"IF($B$7=constants!$C$60,H173,IF($B$8=constants!$C$60,D173,F173))","v":2.2994999999999997},1,0,0,0,{"$f":"IF(OR($B$22=constants!$B$60,AND(I173>$B$12,$B$12<>-1)),O172+(N173-O172)*$O$74,O172+(L173-O172)*$O$74)","v":0},0,0,0,0,0,0,0,0,0,0,0,0]
[1,0.98000000000000065,1.2966845930342292,0.65,2.2844999999999995,2.2994999999999997,2.1864999999999988,2.2014999999999989,{"$f":"IF($B$7=constants!$C$60,G174,IF($B$8=constants!$C$60,C174,E174))","v":2.2844999999999995},{"$f":"IF($B$7=constants!$C$60,H174,IF($B$8=constants!$C$60,D174,F174))","v":2.2994999999999997},1,0,0,0,{"$f":"IF(OR($B$22=constants!$B$60,AND(I174>$B$12,$B$12<>-1)),O173+(N174-O173)*$O$74,O173+(L174-O173)*$O$74)","v":0},0,0,0,0,0,0,0,0,0,0,0,0]
[1,0.99000000000000066,1.298369922350596,0.65,2.2844999999999995,2.2994999999999997,2.1854999999999989,2.200499999999999,{"$f":"IF($B$7=constants!$C$60,G175,IF($B$8=constants!$C$60,C175,E175))","v":2.2844999999999995},{"$f":"IF($B$7=constants!$C$60,H175,IF($B$8=constants!$C$60,D175,F175))","v":2.2994999999999997},1,0,0,0,{"$f":"IF(OR($B$22=constants!$B$60,AND(I175>$B$12,$B$12<>-1)),O174+(N175-O174)*$O$74,O174+(L175-O174)*$O$74)","v":0},0,0,0,0,0,0,0,0,0,0,0,0]
[1,1.0000000000000007,{"$f":"$D$11*B176+$D$12","v":1.3000000000000034},0.65,2.2844999999999995,2.2994999999999997,{"$f":"B176*$H$41+$H$42","v":2.1855000000000002},{"$f":"H175","v":2.200499999999999},{"$f":"IF($B$7=constants!$C$60,G176,IF($B$8=constants!$C$60,C176,E176))","v":2.2844999999999995},{"$f":"IF($B$7=constants!$C$60,H176,IF($B$8=constants!$C$60,D176,F176))","v":2.2994999999999997},1,{"$f":"IF($K176=0,IF($I176>$B$16,L175+($I176-L175)*L$74-J$72,L175-L175/L$74),IF($I176>$B$17,L175+($I176-L175)*L$74-J$72,L175-L175/L$74))","v":2.2844999999999995},{"$f":"IF($K176=0,IF($I176>$B$16,M175+($B$20-M175)*M$74-K$72,M175-M175/M$74),IF($I176>$B$17,M175+($B$20-M175)*M$74-K$72,M175-M175/M$74))","v":2.6},2.2844999999999995,{"$f":"IF(OR($B$22=constants!$B$60,AND(I176>$B$12,$B$12<>-1)),O175+(N176-O175)*$O$74,O175+(L176-O175)*$O$74)","v":2.0560499999999995},2.0360499999999995,{"$f":"IF($K176=0,IF($I176>$B$16,R175+($B$21-R175)*R$74-R$72,R175-R175/R$74),IF($I176>$B$17,R175+($B$21-R175)*R$74-R$72,R175-R175/R$74))","v":2.2000000000000002},2.2000000000000002,0,0,0,0,0,0,0,0,0]
[1,1.0100000000000007,{"$f":"$D$11*$B177+$D$12","v":1.3531200000000032},0.65,{"$f":"$K$11*$B177+$K$12","v":2.3035149999999995},{"$f":"E177+$F$74","v":2.3185149999999997},{"$f":"B177*$H$41+$H$42","v":2.2031999999999998},{"$f":"H176","v":2.200499999999999},{"$f":"IF($B$7=constants!$C$60,G177,IF($B$8=constants!$C$60,C177,E177))","v":2.3035149999999995},{"$f":"IF($B$7=constants!$C$60,H177,IF($B$8=constants!$C$60,D177,F177))","v":2.3185149999999997},1,2.3035149999999995,{"$f":"IF($K177=0,IF($I177>$B$16,M176+($B$20-M176)*M$74-K$72,M176-M176/M$74),IF($I177>$B$17,M176+($B$20-M176)*M$74-K$72,M176-M176/M$74))","v":2.6},2.3035149999999995,{"$f":"IF(OR($B$22=constants!$B$60,AND(I177>$B$12,$B$12<>-1)),O176+(N177-O176)*$O$74,O176+(L177-O176)*$O$74)","v":2.2787684999999995},2.2587684999999995,2.2000000000000002,2.2000000000000002,0,0,0,0,0,0,0,0,0]
[1,1.0200000000000007,{"$f":"$D$11*B178+$D$12","v":1.406240000000003},0.65,{"$f":"$K$11*$B178+$K$12","v":2.3075299999999999},2.32253,2.2209000000000003,2.200499999999999,{"$f":"IF($B$7=constants!$C$60,G178,IF($B$8=constants!$C$60,C178,E178))","v":2.3075299999999999},{"$f":"IF($B$7=constants!$C$60,H178,IF($B$8=constants!$C$60,D178,F178))","v":2.32253},1,2.3075299999999999,{"$f":"IF($K178=0,IF($I178>$B$16,M177+($B$20-M177)*M$74-K$72,M177-M177/M$74),IF($I178>$B$17,M177+($B$20-M177)*M$74-K$72,M177-M177/M$74))","v":2.6},2.3075299999999999,{"$f":"IF(OR($B$22=constants!$B$60,AND(I178>$B$12,$B$12<>-1)),O177+(N178-O177)*$O$74,O177+(L178-O177)*$O$74)","v":2.3046538499999998},2.2846538499999998,2.2000000000000002,2.2000000000000002,0,0,0,0,0,0,0,0,0]
[1,1.0300000000000007,1.4593600000000038,0.65,2.3115449999999997,2.3265449999999999,2.2385999999999999,2.200499999999999,{"$f":"IF($B$7=constants!$C$60,G179,IF($B$8=constants!$C$60,C179,E179))","v":2.3115449999999997},{"$f":"IF($B$7=constants!$C$60,H179,IF($B$8=constants!$C$60,D179,F179))","v":2.3265449999999999},1,2.3115449999999997,2.6,2.3115449999999997,{"$f":"IF(OR($B$22=constants!$B$60,AND(I179>$B$12,$B$12<>-1)),O178+(N179-O178)*$O$74,O178+(L179-O178)*$O$74)","v":2.3108558849999996},2.2908558849999996,2.2000000000000002,2.2000000000000002,0,0,0,0,0,0,0,0,0]
[1,1.0400000000000007,1.5124800000000036,0.65,2.3155599999999996,2.3305599999999997,2.2563000000000004,2.200499999999999,{"$f":"IF($B$7=constants!$C$60,G180,IF($B$8=constants!$C$60,C180,E180))","v":2.3155599999999996},{"$f":"IF($B$7=constants!$C$60,H180,IF($B$8=constants!$C$60,D180,F180))","v":2.3305599999999997},1,2.3155599999999996,2.6,2.3155599999999996,{"$f":"IF(OR($B$22=constants!$B$60,AND(I180>$B$12,$B$12<>-1)),O179+(N180-O179)*$O$74,O179+(L180-O179)*$O$74)","v":2.3150895884999998},2.2950895884999998,2.2000000000000002,2.2000000000000002,0,0,0,0,0,0,0,0,0]
[1,1.0500000000000007,1.5656000000000034,0.65,2.3195749999999995,2.3345749999999996,2.274,2.200499999999999,{"$f":"IF($B$7=constants!$C$60,G181,IF($B$8=constants!$C$60,C181,E181))","v":2.3195749999999995},{"$f":"IF($B$7=constants!$C$60,H181,IF($B$8=constants!$C$60,D181,F181))","v":2.3345749999999996},1,2.3195749999999995,2.6,2.3195749999999995,{"$f":"IF(OR($B$22=constants!$B$60,AND(I181>$B$12,$B$12<>-1)),O180+(N181-O180)*$O$74,O180+(L181-O180)*$O$74)","v":2.3191264588499996},2.2991264588499996,2.2000000000000002,2.2000000000000002,0,0,0,0,0,0,0,0,0]
[1,1.0600000000000007,1.6187200000000033,0.65,2.3235899999999998,2.3385899999999999,2.2917000000000005,2.200499999999999,{"$f":"IF($B$7=constants!$C$60,G182,IF($B$8=constants!$C$60,C182,E182))","v":2.3235899999999998},{"$f":"IF($B$7=constants!$C$60,H182,IF($B$8=constants!$C$60,D182,F182))","v":2.3385899999999999},1,2.3235899999999998,2.6,2.3235899999999998,{"$f":"IF(OR($B$22=constants!$B$60,AND(I182>$B$12,$B$12<>-1)),O181+(N182-O181)*$O$74,O181+(L182-O181)*$O$74)","v":2.3231436458849997},2.3031436458849996,2.2000000000000002,2.2000000000000002,0,0,0,0,0,0,0,0,0]
[1,1.0700000000000007,1.671840000000004,0.65,2.3276049999999997,2.3426049999999998,2.3094000000000001,2.200499999999999,{"$f":"IF($B$7=constants!$C$60,G183,IF($B$8=constants!$C$60,C183,E183))","v":2.3276049999999997},{"$f":"IF($B$7=constants!$C$60,H183,IF($B$8=constants!$C$60,D183,F183))","v":2.3426049999999998},1,2.3276049999999997,2.6,2.3276049999999997,{"$f":"IF(OR($B$22=constants!$B$60,AND(I183>$B$12,$B$12<>-1)),O182+(N183-O182)*$O$74,O182+(L183-O182)*$O$74)","v":2.3271588645884997},2.3071588645884997,2.2000000000000002,2.2000000000000002,0,0,0,0,0,0,0,0,0]
[1,1.0800000000000007,1.7249600000000038,0.65,2.3316199999999996,2.3466199999999997,2.3271000000000006,2.200499999999999,{"$f":"IF($B$7=constants!$C$60,G184,IF($B$8=constants!$C$60,C184,E184))","v":2.3316199999999996},{"$f":"IF($B$7=constants!$C$60,H184,IF($B$8=constants!$C$60,D184,F184))","v":2.3466199999999997},1,2.3316199999999996,2.6,2.3316199999999996,{"$f":"IF(OR($B$22=constants!$B$60,AND(I184>$B$12,$B$12<>-1)),O183+(N184-O183)*$O$74,O183+(L184-O183)*$O$74)","v":2.3311738864588496},2.3111738864588496,2.2000000000000002,2.2000000000000002,0,0,0,0,0,0,0,0,0]
[1,1.0900000000000007,1.7780800000000037,0.65,2.3356349999999999,2.350635,2.3448000000000002,2.200499999999999,{"$f":"IF($B$7=constants!$C$60,G185,IF($B$8=constants!$C$60,C185,E185))","v":2.3356349999999999},{"$f":"IF($B$7=constants!$C$60,H185,IF($B$8=constants!$C$60,D185,F185))","v":2.350635},1,2.3356349999999999,2.6,2.3356349999999999,{"$f":"IF(OR($B$22=constants!$B$60,AND(I185>$B$12,$B$12<>-1)),O184+(N185-O184)*$O$74,O184+(L185-O184)*$O$74)","v":2.3351888886458849},2.3151888886458849,2.2000000000000002,2.2000000000000002,0,0,0,0,0,0,0,0,0]
[1,1.1000000000000008,1.8312000000000035,0.65,2.3396499999999998,2.3546499999999999,2.3625000000000007,2.200499999999999,{"$f":"IF($B$7=constants!$C$60,G186,IF($B$8=constants!$C$60,C186,E186))","v":2.3396499999999998},{"$f":"IF($B$7=constants!$C$60,H186,IF($B$8=constants!$C$60,D186,F186))","v":2.3546499999999999},1,2.3396499999999998,2.6,2.3396499999999998,{"$f":"IF(OR($B$22=constants!$B$60,AND(I186>$B$12,$B$12<>-1)),O185+(N186-O185)*$O$74,O185+(L186-O185)*$O$74)","v":2.3392038888645885},2.3192038888645885,2.2000000000000002,2.2000000000000002,0,0,0,0,0,0,0,0,0]
[1,1.1100000000000008,1.8843200000000033,0.65,2.3436649999999997,2.3586649999999998,2.3802000000000003,2.200499999999999,{"$f":"IF($B$7=constants!$C$60,G187,IF($B$8=constants!$C$60,C187,E187))","v":2.3436649999999997},{"$f":"IF($B$7=constants!$C$60,H187,IF($B$8=constants!$C$60,D187,F187))","v":2.3586649999999998},1,2.3436649999999997,2.6,2.3436649999999997,{"$f":"IF(OR($B$22=constants!$B$60,AND(I187>$B$12,$B$12<>-1)),O186+(N187-O186)*$O$74,O186+(L187-O186)*$O$74)","v":2.3432188888864585},2.3232188888864584,2.2000000000000002,2.2000000000000002,0,0,0,0,0,0,0,0,0]
[1,1.1200000000000008,1.937440000000004,0.65,2.3476799999999995,2.3626799999999997,2.3979000000000008,2.200499999999999,{"$f":"IF($B$7=constants!$C$60,G188,IF($B$8=constants!$C$60,C188,E188))","v":2.3476799999999995},{"$f":"IF($B$7=constants!$C$60,H188,IF($B$8=constants!$C$60,D188,F188))","v":2.3626799999999997},1,2.3476799999999995,2.6,2.3476799999999995,{"$f":"IF(OR($B$22=constants!$B$60,AND(I188>$B$12,$B$12<>-1)),O187+(N188-O187)*$O$74,O187+(L188-O187)*$O$74)","v":2.3472338888886455},2.3272338888886455,2.2000000000000002,2.2000000000000002,0,0,0,0,0,0,0,0,0]
[1,1.1300000000000008,1.9905600000000039,0.65,2.3516949999999999,2.366695,2.4156000000000009,2.200499999999999,{"$f":"IF($B$7=constants!$C$60,G189,IF($B$8=constants!$C$60,C189,E189))","v":2.3516949999999999},{"$f":"IF($B$7=constants!$C$60,H189,IF($B$8=constants!$C$60,D189,F189))","v":2.366695},1,2.3516949999999999,2.6,2.3516949999999999,{"$f":"IF(OR($B$22=constants!$B$60,AND(I189>$B$12,$B$12<>-1)),O188+(N189-O188)*$O$74,O188+(L189-O188)*$O$74)","v":2.3512488888888643},2.3312488888888643,2.2000000000000002,2.2000000000000002,0,0,0,0,0,0,0,0,0]
[1,1.1400000000000008,2.0436800000000037,0.65,2.3557099999999997,2.3707099999999999,2.4333000000000009,2.200499999999999,{"$f":"IF($B$7=constants!$C$60,G190,IF($B$8=constants!$C$60,C190,E190))","v":2.3557099999999997},{"$f":"IF($B$7=constants!$C$60,H190,IF($B$8=constants!$C$60,D190,F190))","v":2.3707099999999999},1,2.3557099999999997,2.6,2.3557099999999997,{"$f":"IF(OR($B$22=constants!$B$60,AND(I190>$B$12,$B$12<>-1)),O189+(N190-O189)*$O$74,O189+(L190-O189)*$O$74)","v":2.3552638888888864},2.3352638888888864,2.2000000000000002,2.2000000000000002,0,0,0,0,0,0,0,0,0]
[1,1.1500000000000008,2.0968000000000035,0.65,2.3597249999999996,2.3747249999999998,2.451000000000001,2.200499999999999,{"$f":"IF($B$7=constants!$C$60,G191,IF($B$8=constants!$C$60,C191,E191))","v":2.3597249999999996},{"$f":"IF($B$7=constants!$C$60,H191,IF($B$8=constants!$C$60,D191,F191))","v":2.3747249999999998},1,2.3597249999999996,2.6,2.3597249999999996,{"$f":"IF(OR($B$22=constants!$B$60,AND(I191>$B$12,$B$12<>-1)),O190+(N191-O190)*$O$74,O190+(L191-O190)*$O$74)","v":2.3592788888888885},2.3392788888888885,2.2000000000000002,2.2000000000000002,0,0,0,0,0,0,0,0,0]
[1,1.1600000000000008,2.1499200000000043,0.65,2.36374,2.3787400000000001,2.468700000000001,2.200499999999999,{"$f":"IF($B$7=constants!$C$60,G192,IF($B$8=constants!$C$60,C192,E192))","v":2.36374},{"$f":"IF($B$7=constants!$C$60,H192,IF($B$8=constants!$C$60,D192,F192))","v":2.3787400000000001},1,2.36374,2.6,2.36374,{"$f":"IF(OR($B$22=constants!$B$60,AND(I192>$B$12,$B$12<>-1)),O191+(N192-O191)*$O$74,O191+(L192-O191)*$O$74)","v":2.3632938888888888},2.3432938888888888,2.2000000000000002,2.2000000000000002,0,0,0,0,0,0,0,0,0]
[1,1.1700000000000008,2.2030400000000041,0.65,2.3677549999999998,2.382755,2.4864000000000011,2.200499999999999,{"$f":"IF($B$7=constants!$C$60,G193,IF($B$8=constants!$C$60,C193,E193))","v":2.3677549999999998},{"$f":"IF($B$7=constants!$C$60,H193,IF($B$8=constants!$C$60,D193,F193))","v":2.382755},1,2.3677549999999998,2.6,{"$f":"IF(M193>I193,L193,M193)","v":2.3677549999999998},{"$f":"IF(OR($B$22=constants!$B$60,AND(I193>$B$12,$B$12<>-1)),O192+(N193-O192)*$O$74,O192+(L193-O192)*$O$74)","v":2.3673088888888887},2.3473088888888887,2.2000000000000002,2.2000000000000002,0,0,0,0,0,0,0,0,0]
[1,1.1800000000000008,2.2561600000000039,0.65,2.3717699999999997,2.3867699999999998,2.5041000000000011,2.200499999999999,{"$f":"IF($B$7=constants!$C$60,G194,IF($B$8=constants!$C$60,C194,E194))","v":2.3717699999999997},{"$f":"IF($B$7=constants!$C$60,H194,IF($B$8=constants!$C$60,D194,F194))","v":2.3867699999999998},1,2.3717699999999997,2.6,{"$f":"IF(M194>I194,L194,M194)","v":2.3717699999999997},{"$f":"IF(OR($B$22=constants!$B$60,AND(I194>$B$12,$B$12<>-1)),O193+(N194-O193)*$O$74,O193+(L194-O193)*$O$74)","v":2.3713238888888886},2.3513238888888885,2.2000000000000002,2.2000000000000002,0,0,0,0,0,0,0,0,0]
[1,1.1900000000000008,2.3092800000000038,0.65,2.3757849999999996,2.3907849999999997,2.5218000000000012,2.200499999999999,{"$f":"IF($B$7=constants!$C$60,G195,IF($B$8=constants!$C$60,C195,E195))","v":2.3757849999999996},{"$f":"IF($B$7=constants!$C$60,H195,IF($B$8=constants!$C$60,D195,F195))","v":2.3907849999999997},1,2.3757849999999996,2.6,2.3757849999999996,{"$f":"IF(OR($B$22=constants!$B$60,AND(I195>$B$12,$B$12<>-1)),O194+(N195-O194)*$O$74,O194+(L195-O194)*$O$74)","v":2.3753388888888884},2.3553388888888884,2.2000000000000002,2.2000000000000002,0,0,0,0,0,0,0,0,0]
[1,1.2000000000000008,2.3624000000000036,0.65,2.3797999999999999,2.3948,2.5395000000000012,2.200499999999999,{"$f":"IF($B$7=constants!$C$60,G196,IF($B$8=constants!$C$60,C196,E196))","v":2.3797999999999999},{"$f":"IF($B$7=constants!$C$60,H196,IF($B$8=constants!$C$60,D196,F196))","v":2.3948},1,2.3797999999999999,2.6,2.3797999999999999,{"$f":"IF(OR($B$22=constants!$B$60,AND(I196>$B$12,$B$12<>-1)),O195+(N196-O195)*$O$74,O195+(L196-O195)*$O$74)","v":2.3793538888888888},2.3593538888888888,2.2000000000000002,2.2000000000000002,0,0,0,0,0,0,0,0,0]
[1,1.2100000000000009,2.4155200000000043,0.65,2.3838149999999998,2.3988149999999999,2.5572000000000012,2.200499999999999,{"$f":"IF($B$7=constants!$C$60,G197,IF($B$8=constants!$C$60,C197,E197))","v":2.3838149999999998},{"$f":"IF($B$7=constants!$C$60,H197,IF($B$8=constants!$C$60,D197,F197))","v":2.3988149999999999},1,2.3838149999999998,2.6,2.3838149999999998,{"$f":"IF(OR($B$22=constants!$B$60,AND(I197>$B$12,$B$12<>-1)),O196+(N197-O196)*$O$74,O196+(L197-O196)*$O$74)","v":2.3833688888888886},2.3633688888888886,2.2000000000000002,2.2000000000000002,0,0,0,0,0,0,0,0,0]
[1,1.2200000000000009,2.4686400000000042,0.65,2.3878299999999997,2.4028299999999998,2.5749000000000013,2.200499999999999,{"$f":"IF($B$7=constants!$C$60,G198,IF($B$8=constants!$C$60,C198,E198))","v":2.3878299999999997},{"$f":"IF($B$7=constants!$C$60,H198,IF($B$8=constants!$C$60,D198,F198))","v":2.4028299999999998},1,2.3878299999999997,2.6,2.3878299999999997,{"$f":"IF(OR($B$22=constants!$B$60,AND(I198>$B$12,$B$12<>-1)),O197+(N198-O197)*$O$74,O197+(L198-O197)*$O$74)","v":2.3873838888888885},2.3673838888888885,2.2000000000000002,2.2000000000000002,0,0,0,0,0,0,0,0,0]
[1,1.2300000000000009,2.521760000000004,0.65,2.391845,2.4068450000000001,2.5926000000000013,2.200499999999999,{"$f":"IF($B$7=constants!$C$60,G199,IF($B$8=constants!$C$60,C199,E199))","v":2.391845},{"$f":"IF($B$7=constants!$C$60,H199,IF($B$8=constants!$C$60,D199,F199))","v":2.4068450000000001},1,2.391845,2.6,2.391845,{"$f":"IF(OR($B$22=constants!$B$60,AND(I199>$B$12,$B$12<>-1)),O198+(N199-O198)*$O$74,O198+(L199-O198)*$O$74)","v":2.3913988888888889},2.3713988888888888,2.2000000000000002,2.2000000000000002,0,0,0,0,0,0,0,0,0]
[1,1.2400000000000009,2.5748800000000038,0.65,2.3958599999999999,2.41086,2.6103000000000014,2.200499999999999,{"$f":"IF($B$7=constants!$C$60,G200,IF($B$8=constants!$C$60,C200,E200))","v":2.3958599999999999},{"$f":"IF($B$7=constants!$C$60,H200,IF($B$8=constants!$C$60,D200,F200))","v":2.41086},1,2.3958599999999999,2.6,2.3958599999999999,{"$f":"IF(OR($B$22=constants!$B$60,AND(I200>$B$12,$B$12<>-1)),O199+(N200-O199)*$O$74,O199+(L200-O199)*$O$74)","v":2.3954138888888887},2.3754138888888887,2.2000000000000002,2.2000000000000002,0,0,0,0,0,0,0,0,0]
[1,1.2500000000000009,{"$f":"$D$15*B201+$D$16","v":2.627999999999997},0.65,2.3998749999999998,2.4148749999999999,{"$f":"B201*$H$46+$H$47","v":2.627999999999997},2.200499999999999,{"$f":"IF($B$7=constants!$C$60,G201,IF($B$8=constants!$C$60,C201,E201))","v":2.3998749999999998},{"$f":"IF($B$7=constants!$C$60,H201,IF($B$8=constants!$C$60,D201,F201))","v":2.4148749999999999},1,2.3998749999999998,2.6,2.3998749999999998,{"$f":"IF(OR($B$22=constants!$B$60,AND(I201>$B$12,$B$12<>-1)),O200+(N201-O200)*$O$74,O200+(L201-O200)*$O$74)","v":2.3994288888888886},2.3794288888888886,2.2000000000000002,2.2000000000000002,0,0,0,0,0,0,0,0,0]
[1,1.2600000000000009,{"$f":"$D$15*$B202+$D$16","v":2.6017199999999971},{"$f":"$G$15*$B202+$G$16","v":0.67642000000000246},2.4038899999999996,2.4188899999999998,{"$f":"B202*$H$46+$H$47","v":2.6017199999999971},2.200499999999999,{"$f":"IF($B$7=constants!$C$60,G202,IF($B$8=constants!$C$60,C202,E202))","v":2.4038899999999996},{"$f":"IF($B$7=constants!$C$60,H202,IF($B$8=constants!$C$60,D202,F202))","v":2.4188899999999998},1,2.4038899999999996,2.6,2.4038899999999996,{"$f":"IF(OR($B$22=constants!$B$60,AND(I202>$B$12,$B$12<>-1)),O201+(N202-O201)*$O$74,O201+(L202-O201)*$O$74)","v":2.4034438888888885},2.3834438888888885,2.2000000000000002,2.2000000000000002,0,0,0,0,0,0,0,0,0]
[1,1.2700000000000009,{"$f":"$D$15*B203+$D$16","v":2.5754399999999973},{"$f":"$G$15*$B203+$G$16","v":0.70284000000000235},2.4079049999999995,2.4229049999999996,2.5754399999999973,2.200499999999999,{"$f":"IF($B$7=constants!$C$60,G203,IF($B$8=constants!$C$60,C203,E203))","v":2.4079049999999995},{"$f":"IF($B$7=constants!$C$60,H203,IF($B$8=constants!$C$60,D203,F203))","v":2.4229049999999996},1,2.4079049999999995,2.6,2.4079049999999995,{"$f":"IF(OR($B$22=constants!$B$60,AND(I203>$B$12,$B$12<>-1)),O202+(N203-O202)*$O$74,O202+(L203-O202)*$O$74)","v":2.4074588888888884},2.3874588888888884,2.2000000000000002,2.2000000000000002,0,0,0,0,0,0,0,0,0]
[1,1.2800000000000009,2.549159999999997,0.72926000000000224,2.4119199999999998,2.42692,2.549159999999997,2.200499999999999,{"$f":"IF($B$7=constants!$C$60,G204,IF($B$8=constants!$C$60,C204,E204))","v":2.4119199999999998},{"$f":"IF($B$7=constants!$C$60,H204,IF($B$8=constants!$C$60,D204,F204))","v":2.42692},1,2.4119199999999998,2.6,2.4119199999999998,{"$f":"IF(OR($B$22=constants!$B$60,AND(I204>$B$12,$B$12<>-1)),O203+(N204-O203)*$O$74,O203+(L204-O203)*$O$74)","v":2.4114738888888887},2.3914738888888887,2.2000000000000002,2.2000000000000002,0,0,0,0,0,0,0,0,0]
[{"$f":"IF(B205<=100,1,IF(B205<=200,2,3))","v":1},1.2900000000000009,2.5228799999999971,0.75568000000000257,2.4159349999999997,2.4309349999999998,2.5228799999999971,2.200499999999999,{"$f":"IF($B$7=constants!$C$60,G205,IF($B$8=constants!$C$60,C205,E205))","v":2.4159349999999997},{"$f":"IF($B$7=constants!$C$60,H205,IF($B$8=constants!$C$60,D205,F205))","v":2.4309349999999998},1,2.4159349999999997,2.6,2.4159349999999997,{"$f":"IF(OR($B$22=constants!$B$60,AND(I205>$B$12,$B$12<>-1)),O204+(N205-O204)*$O$74,O204+(L205-O204)*$O$74)","v":2.4154888888888886},{"$f":"IF(O205=0,0,O205-$P$72)","v":2.3954888888888886},2.2000000000000002,2.2000000000000002,{"$f":"S$72*IF(S$71=0,$L205,IF(S$71=1,$R205,IF($B$12=-1,$L205,IF($I205>$B$12,$R205,$L205))))","v":0},0,0,0,0,0,{"$f":"IF(V205=0,0,V205-Y$72)","v":0},{"$f":"IF(W205=0,0,W205-Z$72)","v":0},{"$f":"IF(X205=0,0,X205-AA$72)","v":0}]
[1,{"$f":"B205+0.01","v":1.3000000000000009},2.4965999999999968,0.78210000000000246,2.41995,2.4349500000000002,2.4965999999999968,2.200499999999999,{"$f":"IF($B$7=constants!$C$60,G206,IF($B$8=constants!$C$60,C206,E206))","v":2.41995},{"$f":"IF($B$7=constants!$C$60,H206,IF($B$8=constants!$C$60,D206,F206))","v":2.4349500000000002},{"$f":"IF(AND(I206>$B$16,K205=0),1,IF(AND(I206<$B$17,K205=1),0,K205))","v":1},2.41995,2.6,2.41995,{"$f":"IF(OR($B$22=constants!$B$60,AND(I206>$B$12,$B$12<>-1)),O205+(N206-O205)*$O$74,O205+(L206-O205)*$O$74)","v":2.4195038888888889},2.3995038888888889,2.2000000000000002,{"$f":"IF(Q206>I206,I206,Q206)","v":2.2000000000000002},0,0,0,{"$f":"V205+(S206-V$72-V205)*V$74","v":0},{"$f":"W205+(T206-W$72-W205)*W$74","v":0},{"$f":"X205+(U206-X$72-X205)*X$74","v":0},0,0,0]
[1,1.3100000000000009,2.470319999999997,0.80852000000000235,2.4239649999999999,2.438965,2.470319999999997,2.200499999999999,{"$f":"IF($B$7=constants!$C$60,G207,IF($B$8=constants!$C$60,C207,E207))","v":2.4239649999999999},{"$f":"IF($B$7=constants!$C$60,H207,IF($B$8=constants!$C$60,D207,F207))","v":2.438965},1,2.4239649999999999,2.6,2.4239649999999999,{"$f":"IF(OR($B$22=constants!$B$60,AND(I207>$B$12,$B$12<>-1)),O206+(N207-O206)*$O$74,O206+(L207-O206)*$O$74)","v":2.4235188888888888},2.4035188888888888,2.2000000000000002,2.2000000000000002,0,0,0,0,0,0,0,0,0]
[1,1.320000000000001,2.4440399999999971,0.83494000000000268,2.4279799999999998,2.4429799999999999,2.4440399999999971,2.200499999999999,{"$f":"IF($B$7=constants!$C$60,G208,IF($B$8=constants!$C$60,C208,E208))","v":2.4279799999999998},{"$f":"IF($B$7=constants!$C$60,H208,IF($B$8=constants!$C$60,D208,F208))","v":2.4429799999999999},1,2.4279799999999998,2.6,2.4279799999999998,{"$f":"IF(OR($B$22=constants!$B$60,AND(I208>$B$12,$B$12<>-1)),O207+(N208-O207)*$O$74,O207+(L208-O207)*$O$74)","v":2.4275338888888887},2.4075338888888886,2.2000000000000002,2.2000000000000002,0,0,0,0,0,0,0,0,0]
[1,1.330000000000001,2.4177599999999968,0.86136000000000257,2.4319949999999997,{"$f":"E209+$F$74","v":2.4469949999999998},2.4177599999999968,2.200499999999999,{"$f":"IF($B$7=constants!$C$60,G209,IF($B$8=constants!$C$60,C209,E209))","v":2.4319949999999997},{"$f":"IF($B$7=constants!$C$60,H209,IF($B$8=constants!$C$60,D209,F209))","v":2.4469949999999998},1,2.4319949999999997,2.6,2.4319949999999997,{"$f":"IF(OR($B$22=constants!$B$60,AND(I209>$B$12,$B$12<>-1)),O208+(N209-O208)*$O$74,O208+(L209-O208)*$O$74)","v":2.4315488888888885},2.4115488888888885,2.2000000000000002,2.2000000000000002,0,0,0,0,0,0,0,0,0]
[1,1.340000000000001,2.3914799999999969,0.88778000000000246,2.4360099999999996,2.4510099999999997,2.3914799999999969,2.200499999999999,{"$f":"IF($B$7=constants!$C$60,G210,IF($B$8=constants!$C$60,C210,E210))","v":2.4360099999999996},{"$f":"IF($B$7=constants!$C$60,H210,IF($B$8=constants!$C$60,D210,F210))","v":2.4510099999999997},1,2.4360099999999996,2.6,2.4360099999999996,{"$f":"IF(OR($B$22=constants!$B$60,AND(I210>$B$12,$B$12<>-1)),O209+(N210-O209)*$O$74,O209+(L210-O209)*$O$74)","v":2.4355638888888884},2.4155638888888884,2.2000000000000002,2.2000000000000002,0,0,0,0,0,0,0,0,0]
[1,1.350000000000001,2.3651999999999971,0.91420000000000279,2.4400249999999999,2.455025,2.3651999999999971,2.200499999999999,{"$f":"IF($B$7=constants!$C$60,G211,IF($B$8=constants!$C$60,C211,E211))","v":2.4400249999999999},{"$f":"IF($B$7=constants!$C$60,H211,IF($B$8=constants!$C$60,D211,F211))","v":2.455025},1,2.4400249999999999,2.6,2.4400249999999999,{"$f":"IF(OR($B$22=constants!$B$60,AND(I211>$B$12,$B$12<>-1)),O210+(N211-O210)*$O$74,O210+(L211-O210)*$O$74)","v":2.4395788888888887},2.4195788888888887,2.2000000000000002,2.2000000000000002,0,0,0,0,0,0,0,0,0]
[1,1.360000000000001,2.3389199999999968,0.94062000000000268,2.4440399999999998,2.4590399999999999,2.3389199999999968,2.200499999999999,{"$f":"IF($B$7=constants!$C$60,G212,IF($B$8=constants!$C$60,C212,E212))","v":2.4440399999999998},{"$f":"IF($B$7=constants!$C$60,H212,IF($B$8=constants!$C$60,D212,F212))","v":2.4590399999999999},1,2.4440399999999998,2.6,2.4440399999999998,{"$f":"IF(OR($B$22=constants!$B$60,AND(I212>$B$12,$B$12<>-1)),O211+(N212-O211)*$O$74,O211+(L212-O211)*$O$74)","v":2.4435938888888886},2.4235938888888886,2.2000000000000002,2.2000000000000002,0,0,0,0,0,0,0,0,0]
[1,1.370000000000001,2.3126399999999969,0.96704000000000256,2.4480550000000001,2.4630550000000002,2.3126399999999969,2.200499999999999,{"$f":"IF($B$7=constants!$C$60,G213,IF($B$8=constants!$C$60,C213,E213))","v":2.4480550000000001},{"$f":"IF($B$7=constants!$C$60,H213,IF($B$8=constants!$C$60,D213,F213))","v":2.4630550000000002},1,2.4480550000000001,2.6,2.4480550000000001,{"$f":"IF(OR($B$22=constants!$B$60,AND(I213>$B$12,$B$12<>-1)),O212+(N213-O212)*$O$74,O212+(L213-O212)*$O$74)","v":2.4476088888888889},2.4276088888888889,2.2000000000000002,2.2000000000000002,0,0,0,0,0,0,0,0,0]
[1,1.380000000000001,2.2863599999999971,0.99346000000000245,2.45207,2.4670700000000001,2.2863599999999971,2.200499999999999,{"$f":"IF($B$7=constants!$C$60,G214,IF($B$8=constants!$C$60,C214,E214))","v":2.45207},{"$f":"IF($B$7=constants!$C$60,H214,IF($B$8=constants!$C$60,D214,F214))","v":2.4670700000000001},1,2.45207,2.6,2.45207,{"$f":"IF(OR($B$22=constants!$B$60,AND(I214>$B$12,$B$12<>-1)),O213+(N214-O213)*$O$74,O213+(L214-O213)*$O$74)","v":2.4516238888888888},2.4316238888888888,2.2000000000000002,2.2000000000000002,0,0,0,0,0,0,0,0,0]
[1,1.390000000000001,2.2600799999999968,1.0198800000000028,2.4560849999999999,2.471085,2.2600799999999968,2.200499999999999,{"$f":"IF($B$7=constants!$C$60,G215,IF($B$8=constants!$C$60,C215,E215))","v":2.4560849999999999},{"$f":"IF($B$7=constants!$C$60,H215,IF($B$8=constants!$C$60,D215,F215))","v":2.471085},1,2.4560849999999999,2.6,2.4560849999999999,{"$f":"IF(OR($B$22=constants!$B$60,AND(I215>$B$12,$B$12<>-1)),O214+(N215-O214)*$O$74,O214+(L215-O214)*$O$74)","v":2.4556388888888887},2.4356388888888887,2.2000000000000002,2.2000000000000002,0,0,0,0,0,0,0,0,0]
[1,1.400000000000001,2.2337999999999969,1.0463000000000027,2.4600999999999997,2.4750999999999999,2.2337999999999969,2.200499999999999,{"$f":"IF($B$7=constants!$C$60,G216,IF($B$8=constants!$C$60,C216,E216))","v":2.4600999999999997},{"$f":"IF($B$7=constants!$C$60,H216,IF($B$8=constants!$C$60,D216,F216))","v":2.4750999999999999},1,2.4600999999999997,2.6,2.4600999999999997,{"$f":"IF(OR($B$22=constants!$B$60,AND(I216>$B$12,$B$12<>-1)),O215+(N216-O215)*$O$74,O215+(L216-O215)*$O$74)","v":2.4596538888888886},2.4396538888888886,2.2000000000000002,2.2000000000000002,0,0,0,0,0,0,0,0,0]
[1,1.410000000000001,2.207519999999997,1.0727200000000026,2.4641149999999996,2.4791149999999997,2.207519999999997,2.200499999999999,{"$f":"IF($B$7=constants!$C$60,G217,IF($B$8=constants!$C$60,C217,E217))","v":2.4641149999999996},{"$f":"IF($B$7=constants!$C$60,H217,IF($B$8=constants!$C$60,D217,F217))","v":2.4791149999999997},1,2.4641149999999996,2.6,2.4641149999999996,{"$f":"IF(OR($B$22=constants!$B$60,AND(I217>$B$12,$B$12<>-1)),O216+(N217-O216)*$O$74,O216+(L217-O216)*$O$74)","v":2.4636688888888885},2.4436688888888884,2.2000000000000002,2.2000000000000002,0,0,0,0,0,0,0,0,0]
[1,1.420000000000001,2.1812399999999967,1.0991400000000029,2.4681299999999999,2.4831300000000001,2.1812399999999967,2.200499999999999,{"$f":"IF($B$7=constants!$C$60,G218,IF($B$8=constants!$C$60,C218,E218))","v":2.4681299999999999},{"$f":"IF($B$7=constants!$C$60,H218,IF($B$8=constants!$C$60,D218,F218))","v":2.4831300000000001},1,2.4681299999999999,2.6,2.4681299999999999,{"$f":"IF(OR($B$22=constants!$B$60,AND(I218>$B$12,$B$12<>-1)),O217+(N218-O217)*$O$74,O217+(L218-O217)*$O$74)","v":2.4676838888888888},2.4476838888888888,2.2000000000000002,2.2000000000000002,0,0,0,0,0,0,0,0,0]
[1,1.430000000000001,2.1549599999999969,1.1255600000000028,2.4721449999999998,2.4871449999999999,2.1549599999999969,2.200499999999999,{"$f":"IF($B$7=constants!$C$60,G219,IF($B$8=constants!$C$60,C219,E219))","v":2.4721449999999998},{"$f":"IF($B$7=constants!$C$60,H219,IF($B$8=constants!$C$60,D219,F219))","v":2.4871449999999999},1,2.4721449999999998,2.6,2.4721449999999998,{"$f":"IF(OR($B$22=constants!$B$60,AND(I219>$B$12,$B$12<>-1)),O218+(N219-O218)*$O$74,O218+(L219-O218)*$O$74)","v":2.4716988888888887},2.4516988888888886,2.2000000000000002,2.2000000000000002,0,0,0,0,0,0,0,0,0]
[1,1.4400000000000011,2.128679999999997,1.1519800000000027,2.4761599999999997,2.4911599999999998,2.128679999999997,2.200499999999999,{"$f":"IF($B$7=constants!$C$60,G220,IF($B$8=constants!$C$60,C220,E220))","v":2.4761599999999997},{"$f":"IF($B$7=constants!$C$60,H220,IF($B$8=constants!$C$60,D220,F220))","v":2.4911599999999998},1,2.4761599999999997,2.6,2.4761599999999997,{"$f":"IF(OR($B$22=constants!$B$60,AND(I220>$B$12,$B$12<>-1)),O219+(N220-O219)*$O$74,O219+(L220-O219)*$O$74)","v":2.4757138888888885},2.4557138888888885,2.2000000000000002,2.2000000000000002,0,0,0,0,0,0,0,0,0]
[1,1.4500000000000011,2.1023999999999967,1.178400000000003,2.480175,2.4951750000000001,2.1023999999999967,2.200499999999999,{"$f":"IF($B$7=constants!$C$60,G221,IF($B$8=constants!$C$60,C221,E221))","v":2.480175},{"$f":"IF($B$7=constants!$C$60,H221,IF($B$8=constants!$C$60,D221,F221))","v":2.4951750000000001},1,2.480175,2.6,2.480175,{"$f":"IF(OR($B$22=constants!$B$60,AND(I221>$B$12,$B$12<>-1)),O220+(N221-O220)*$O$74,O220+(L221-O220)*$O$74)","v":2.4797288888888889},2.4597288888888889,2.2000000000000002,2.2000000000000002,0,0,0,0,0,0,0,0,0]
[1,1.4600000000000011,2.0761199999999969,1.2048200000000029,2.4841899999999999,2.49919,2.0761199999999969,2.200499999999999,{"$f":"IF($B$7=constants!$C$60,G222,IF($B$8=constants!$C$60,C222,E222))","v":2.4841899999999999},{"$f":"IF($B$7=constants!$C$60,H222,IF($B$8=constants!$C$60,D222,F222))","v":2.49919},1,2.4841899999999999,2.6,2.4841899999999999,{"$f":"IF(OR($B$22=constants!$B$60,AND(I222>$B$12,$B$12<>-1)),O221+(N222-O221)*$O$74,O221+(L222-O221)*$O$74)","v":2.4837438888888888},2.4637438888888887,2.2000000000000002,2.2000000000000002,0,0,0,0,0,0,0,0,0]
[1,1.4700000000000011,2.0498399999999966,1.2312400000000028,2.4882049999999998,2.5032049999999999,2.0498399999999966,2.200499999999999,{"$f":"IF($B$7=constants!$C$60,G223,IF($B$8=constants!$C$60,C223,E223))","v":2.4882049999999998},{"$f":"IF($B$7=constants!$C$60,H223,IF($B$8=constants!$C$60,D223,F223))","v":2.5032049999999999},1,2.4882049999999998,2.6,2.4882049999999998,{"$f":"IF(OR($B$22=constants!$B$60,AND(I223>$B$12,$B$12<>-1)),O222+(N223-O222)*$O$74,O222+(L223-O222)*$O$74)","v":2.4877588888888886},2.4677588888888886,2.2000000000000002,2.2000000000000002,0,0,0,0,0,0,0,0,0]
[1,1.4800000000000011,2.0235599999999967,1.2576600000000027,2.4922199999999997,2.5072199999999998,2.0235599999999967,2.200499999999999,{"$f":"IF($B$7=constants!$C$60,G224,IF($B$8=constants!$C$60,C224,E224))","v":2.4922199999999997},{"$f":"IF($B$7=constants!$C$60,H224,IF($B$8=constants!$C$60,D224,F224))","v":2.5072199999999998},1,2.4922199999999997,2.6,2.4922199999999997,{"$f":"IF(OR($B$22=constants!$B$60,AND(I224>$B$12,$B$12<>-1)),O223+(N224-O223)*$O$74,O223+(L224-O223)*$O$74)","v":2.4917738888888885},2.4717738888888885,2.2000000000000002,2.2000000000000002,0,0,0,0,0,0,0,0,0]
[1,1.4900000000000011,1.9972799999999968,1.284080000000003,2.496235,2.5112350000000001,1.9972799999999968,2.200499999999999,{"$f":"IF($B$7=constants!$C$60,G225,IF($B$8=constants!$C$60,C225,E225))","v":2.496235},{"$f":"IF($B$7=constants!$C$60,H225,IF($B$8=constants!$C$60,D225,F225))","v":2.5112350000000001},1,2.496235,2.6,2.496235,{"$f":"IF(OR($B$22=constants!$B$60,AND(I225>$B$12,$B$12<>-1)),O224+(N225-O224)*$O$74,O224+(L225-O224)*$O$74)","v":2.4957888888888888},2.4757888888888888,2.2000000000000002,2.2000000000000002,0,0,0,0,0,0,0,0,0]
[1,1.5000000000000011,{"$f":"$D$19*B226+$D$20","v":1.9710000000000032},1.3105000000000029,2.5002499999999999,2.51525,{"$f":"B226*$H$51+$H$52","v":1.9710000000000032},2.200499999999999,{"$f":"IF($B$7=constants!$C$60,G226,IF($B$8=constants!$C$60,C226,E226))","v":2.5002499999999999},{"$f":"IF($B$7=constants!$C$60,H226,IF($B$8=constants!$C$60,D226,F226))","v":2.51525},1,2.5002499999999999,2.6,2.5002499999999999,{"$f":"IF(OR($B$22=constants!$B$60,AND(I226>$B$12,$B$12<>-1)),O225+(N226-O225)*$O$74,O225+(L226-O225)*$O$74)","v":2.4998038888888887},2.4798038888888887,2.2000000000000002,2.2000000000000002,0,0,0,0,0,0,0,0,0]
[1,1.5100000000000011,{"$f":"$D$19*B227+$D$20","v":1.9972800000000031},{"$f":"D226","v":1.3105000000000029},2.5042649999999997,2.5192649999999999,{"$f":"B227*$H$51+$H$52","v":1.9972800000000031},2.200499999999999,{"$f":"IF($B$7=constants!$C$60,G227,IF($B$8=constants!$C$60,C227,E227))","v":2.5042649999999997},{"$f":"IF($B$7=constants!$C$60,H227,IF($B$8=constants!$C$60,D227,F227))","v":2.5192649999999999},1,2.5042649999999997,2.6,2.5042649999999997,{"$f":"IF(OR($B$22=constants!$B$60,AND(I227>$B$12,$B$12<>-1)),O226+(N227-O226)*$O$74,O226+(L227-O226)*$O$74)","v":2.5038188888888886},2.4838188888888886,2.2000000000000002,2.2000000000000002,0,0,0,0,0,0,0,0,0]
[1,1.5200000000000011,2.0235600000000029,{"$f":"D227","v":1.3105000000000029},2.5082800000000001,2.5232800000000002,2.0235600000000029,2.200499999999999,{"$f":"IF($B$7=constants!$C$60,G228,IF($B$8=constants!$C$60,C228,E228))","v":2.5082800000000001},{"$f":"IF($B$7=constants!$C$60,H228,IF($B$8=constants!$C$60,D228,F228))","v":2.5232800000000002},1,2.5082800000000001,2.6,2.5082800000000001,{"$f":"IF(OR($B$22=constants!$B$60,AND(I228>$B$12,$B$12<>-1)),O227+(N228-O227)*$O$74,O227+(L228-O227)*$O$74)","v":2.5078338888888889},2.4878338888888889,2.2000000000000002,2.2000000000000002,0,0,0,0,0,0,0,0,0]
[1,1.5300000000000011,2.0498400000000028,1.3105000000000029,2.5122949999999999,2.5272950000000001,2.0498400000000028,2.200499999999999,{"$f":"IF($B$7=constants!$C$60,G229,IF($B$8=constants!$C$60,C229,E229))","v":2.5122949999999999},{"$f":"IF($B$7=constants!$C$60,H229,IF($B$8=constants!$C$60,D229,F229))","v":2.5272950000000001},1,2.5122949999999999,2.6,2.5122949999999999,{"$f":"IF(OR($B$22=constants!$B$60,AND(I229>$B$12,$B$12<>-1)),O228+(N229-O228)*$O$74,O228+(L229-O228)*$O$74)","v":2.5118488888888888},2.4918488888888888,2.2000000000000002,2.2000000000000002,0,0,0,0,0,0,0,0,0]
[1,1.5400000000000011,2.0761200000000026,1.3105000000000029,2.5163099999999998,2.5313099999999999,2.0761200000000026,2.200499999999999,{"$f":"IF($B$7=constants!$C$60,G230,IF($B$8=constants!$C$60,C230,E230))","v":2.5163099999999998},{"$f":"IF($B$7=constants!$C$60,H230,IF($B$8=constants!$C$60,D230,F230))","v":2.5313099999999999},1,2.5163099999999998,2.6,2.5163099999999998,{"$f":"IF(OR($B$22=constants!$B$60,AND(I230>$B$12,$B$12<>-1)),O229+(N230-O229)*$O$74,O229+(L230-O229)*$O$74)","v":2.5158638888888887},2.4958638888888887,2.2000000000000002,2.2000000000000002,0,0,0,0,0,0,0,0,0]
[1,1.5500000000000012,2.1024000000000034,1.3105000000000029,2.5203249999999997,2.5353249999999998,2.1024000000000034,2.200499999999999,{"$f":"IF($B$7=constants!$C$60,G231,IF($B$8=constants!$C$60,C231,E231))","v":2.5203249999999997},{"$f":"IF($B$7=constants!$C$60,H231,IF($B$8=constants!$C$60,D231,F231))","v":2.5353249999999998},1,2.5203249999999997,2.6,2.5203249999999997,{"$f":"IF(OR($B$22=constants!$B$60,AND(I231>$B$12,$B$12<>-1)),O230+(N231-O230)*$O$74,O230+(L231-O230)*$O$74)","v":2.5198788888888886},2.4998788888888885,2.2000000000000002,2.2000000000000002,0,0,0,0,0,0,0,0,0]
[1,1.5600000000000012,2.1286800000000032,1.3105000000000029,2.52434,2.5393400000000002,2.1286800000000032,2.200499999999999,{"$f":"IF($B$7=constants!$C$60,G232,IF($B$8=constants!$C$60,C232,E232))","v":2.52434},{"$f":"IF($B$7=constants!$C$60,H232,IF($B$8=constants!$C$60,D232,F232))","v":2.5393400000000002},1,2.52434,2.6,2.52434,{"$f":"IF(OR($B$22=constants!$B$60,AND(I232>$B$12,$B$12<>-1)),O231+(N232-O231)*$O$74,O231+(L232-O231)*$O$74)","v":2.5238938888888889},2.5038938888888889,2.2000000000000002,2.2000000000000002,0,0,0,0,0,0,0,0,0]
[1,1.5700000000000012,2.1549600000000031,1.3105000000000029,2.5283549999999999,2.543355,2.1549600000000031,2.200499999999999,{"$f":"IF($B$7=constants!$C$60,G233,IF($B$8=constants!$C$60,C233,E233))","v":2.5283549999999999},{"$f":"IF($B$7=constants!$C$60,H233,IF($B$8=constants!$C$60,D233,F233))","v":2.543355},1,2.5283549999999999,2.6,2.5283549999999999,{"$f":"IF(OR($B$22=constants!$B$60,AND(I233>$B$12,$B$12<>-1)),O232+(N233-O232)*$O$74,O232+(L233-O232)*$O$74)","v":2.5279088888888888},2.5079088888888887,2.2000000000000002,2.2000000000000002,0,0,0,0,0,0,0,0,0]
[1,1.5800000000000012,2.181240000000003,1.3105000000000029,2.5323699999999998,2.5473699999999999,2.181240000000003,2.200499999999999,{"$f":"IF($B$7=constants!$C$60,G234,IF($B$8=constants!$C$60,C234,E234))","v":2.5323699999999998},{"$f":"IF($B$7=constants!$C$60,H234,IF($B$8=constants!$C$60,D234,F234))","v":2.5473699999999999},1,2.5323699999999998,2.6,2.5323699999999998,{"$f":"IF(OR($B$22=constants!$B$60,AND(I234>$B$12,$B$12<>-1)),O233+(N234-O233)*$O$74,O233+(L234-O233)*$O$74)","v":2.5319238888888886},2.5119238888888886,2.2000000000000002,2.2000000000000002,0,0,0,0,0,0,0,0,0]
[1,1.5900000000000012,2.2075200000000028,1.3105000000000029,2.5363850000000001,2.5513850000000002,2.2075200000000028,2.200499999999999,{"$f":"IF($B$7=constants!$C$60,G235,IF($B$8=constants!$C$60,C235,E235))","v":2.5363850000000001},{"$f":"IF($B$7=constants!$C$60,H235,IF($B$8=constants!$C$60,D235,F235))","v":2.5513850000000002},1,2.5363850000000001,2.6,2.5363850000000001,{"$f":"IF(OR($B$22=constants!$B$60,AND(I235>$B$12,$B$12<>-1)),O234+(N235-O234)*$O$74,O234+(L235-O234)*$O$74)","v":2.535938888888889},2.5159388888888889,2.2000000000000002,2.2000000000000002,0,0,0,0,0,0,0,0,0]
[1,1.6000000000000012,2.2338000000000036,1.3105000000000029,2.5404,2.5554000000000001,2.2338000000000036,2.200499999999999,{"$f":"IF($B$7=constants!$C$60,G236,IF($B$8=constants!$C$60,C236,E236))","v":2.5404},{"$f":"IF($B$7=constants!$C$60,H236,IF($B$8=constants!$C$60,D236,F236))","v":2.5554000000000001},1,2.5404,2.6,2.5404,{"$f":"IF(OR($B$22=constants!$B$60,AND(I236>$B$12,$B$12<>-1)),O235+(N236-O235)*$O$74,O235+(L236-O235)*$O$74)","v":2.5399538888888888},2.5199538888888888,2.2000000000000002,2.2000000000000002,0,0,0,0,0,0,0,0,0]
[1,1.6100000000000012,2.2600800000000034,1.3105000000000029,2.5444149999999999,2.559415,2.2600800000000034,2.200499999999999,{"$f":"IF($B$7=constants!$C$60,G237,IF($B$8=constants!$C$60,C237,E237))","v":2.5444149999999999},{"$f":"IF($B$7=constants!$C$60,H237,IF($B$8=constants!$C$60,D237,F237))","v":2.559415},1,2.5444149999999999,2.6,2.5444149999999999,{"$f":"IF(OR($B$22=constants!$B$60,AND(I237>$B$12,$B$12<>-1)),O236+(N237-O236)*$O$74,O236+(L237-O236)*$O$74)","v":2.5439688888888887},2.5239688888888887,2.2000000000000002,2.2000000000000002,{"$f":"S$72*IF(S$71=0,$L237,IF(S$71=1,$R237,IF($B$12=-1,$L237,IF($I237>$B$12,$R237,$L237))))","v":0},0,0,0,0,0,0,0,0]
[1,1.6200000000000012,2.2863600000000033,1.3105000000000029,2.5484299999999998,2.5634299999999999,2.2863600000000033,2.200499999999999,{"$f":"IF($B$7=constants!$C$60,G238,IF($B$8=constants!$C$60,C238,E238))","v":2.5484299999999998},{"$f":"IF($B$7=constants!$C$60,H238,IF($B$8=constants!$C$60,D238,F238))","v":2.5634299999999999},1,2.5484299999999998,2.6,2.5484299999999998,{"$f":"IF(OR($B$22=constants!$B$60,AND(I238>$B$12,$B$12<>-1)),O237+(N238-O237)*$O$74,O237+(L238-O237)*$O$74)","v":2.5479838888888886},2.5279838888888886,2.2000000000000002,2.2000000000000002,0,0,0,0,0,0,0,0,0]
[1,1.6300000000000012,2.3126400000000031,1.3105000000000029,2.5524449999999996,2.5674449999999998,2.3126400000000031,2.200499999999999,{"$f":"IF($B$7=constants!$C$60,G239,IF($B$8=constants!$C$60,C239,E239))","v":2.5524449999999996},{"$f":"IF($B$7=constants!$C$60,H239,IF($B$8=constants!$C$60,D239,F239))","v":2.5674449999999998},1,2.5524449999999996,2.6,2.5524449999999996,{"$f":"IF(OR($B$22=constants!$B$60,AND(I239>$B$12,$B$12<>-1)),O238+(N239-O238)*$O$74,O238+(L239-O238)*$O$74)","v":2.5519988888888885},2.5319988888888885,2.2000000000000002,2.2000000000000002,0,0,0,0,0,0,0,0,0]
[1,1.6400000000000012,2.338920000000003,1.3105000000000029,2.55646,2.5714600000000001,2.338920000000003,2.200499999999999,{"$f":"IF($B$7=constants!$C$60,G240,IF($B$8=constants!$C$60,C240,E240))","v":2.55646},{"$f":"IF($B$7=constants!$C$60,H240,IF($B$8=constants!$C$60,D240,F240))","v":2.5714600000000001},1,{"$f":"IF($K240=0,IF($I240>$B$16,L239+($I240-L239)*L$74-J$72,L239-L239/L$74),IF($I240>$B$17,L239+($I240-L239)*L$74-J$72,L239-L239/L$74))","v":2.55646},2.6,2.55646,{"$f":"IF(OR($B$22=constants!$B$60,AND(I240>$B$12,$B$12<>-1)),O239+(N240-O239)*$O$74,O239+(L240-O239)*$O$74)","v":2.5560138888888888},2.5360138888888888,{"$f":"IF($K240=0,IF($I240>$B$16,R239+($B$21-R239)*R$74-R$72,R239-R239/R$74),IF($I240>$B$17,R239+($B$21-R239)*R$74-R$72,R239-R239/R$74))","v":2.2000000000000002},2.2000000000000002,0,0,0,0,0,0,0,0,0]
[1,1.6500000000000012,2.3652000000000029,1.3105000000000029,2.5604749999999998,{"$f":"E241+$F$74","v":2.575475},2.3652000000000029,{"$f":"H240","v":2.200499999999999},{"$f":"IF($B$7=constants!$C$60,G241,IF($B$8=constants!$C$60,C241,E241))","v":2.5604749999999998},{"$f":"IF($B$7=constants!$C$60,H241,IF($B$8=constants!$C$60,D241,F241))","v":2.575475},1,2.5604749999999998,2.6,2.5604749999999998,{"$f":"IF(OR($B$22=constants!$B$60,AND(I241>$B$12,$B$12<>-1)),O240+(N241-O240)*$O$74,O240+(L241-O240)*$O$74)","v":2.5600288888888887},2.5400288888888887,2.2000000000000002,2.2000000000000002,0,0,0,0,0,0,0,0,0]
[1,1.6600000000000013,2.3914800000000036,1.3105000000000029,{"$f":"$K$11*$B242+$K$12","v":2.5644900000000002},2.5794900000000003,2.3914800000000036,2.200499999999999,{"$f":"IF($B$7=constants!$C$60,G242,IF($B$8=constants!$C$60,C242,E242))","v":2.5644900000000002},{"$f":"IF($B$7=constants!$C$60,H242,IF($B$8=constants!$C$60,D242,F242))","v":2.5794900000000003},1,2.5644900000000002,{"$f":"IF($K242=0,IF($I242>$B$16,M241+($B$20-M241)*M$74-K$72,M241-M241/M$74),IF($I242>$B$17,M241+($B$20-M241)*M$74-K$72,M241-M241/M$74))","v":2.6},2.5644900000000002,{"$f":"IF(OR($B$22=constants!$B$60,AND(I242>$B$12,$B$12<>-1)),O241+(N242-O241)*$O$74,O241+(L242-O241)*$O$74)","v":2.564043888888889},2.544043888888889,2.2000000000000002,2.2000000000000002,0,0,0,0,0,0,0,0,0]
[1,1.6700000000000013,2.4177600000000035,1.3105000000000029,2.568505,2.5835050000000002,2.4177600000000035,2.200499999999999,{"$f":"IF($B$7=constants!$C$60,G243,IF($B$8=constants!$C$60,C243,E243))","v":2.568505},{"$f":"IF($B$7=constants!$C$60,H243,IF($B$8=constants!$C$60,D243,F243))","v":2.5835050000000002},1,2.568505,2.6,2.568505,{"$f":"IF(OR($B$22=constants!$B$60,AND(I243>$B$12,$B$12<>-1)),O242+(N243-O242)*$O$74,O242+(L243-O242)*$O$74)","v":2.5680588888888889},2.5480588888888889,2.2000000000000002,2.2000000000000002,0,0,0,0,0,0,0,0,0]
[1,1.6800000000000013,2.4440400000000033,1.3105000000000029,2.5725199999999999,2.58752,2.4440400000000033,2.200499999999999,{"$f":"IF($B$7=constants!$C$60,G244,IF($B$8=constants!$C$60,C244,E244))","v":2.5725199999999999},{"$f":"IF($B$7=constants!$C$60,H244,IF($B$8=constants!$C$60,D244,F244))","v":2.58752},1,2.5725199999999999,2.6,2.5725199999999999,{"$f":"IF(OR($B$22=constants!$B$60,AND(I244>$B$12,$B$12<>-1)),O243+(N244-O243)*$O$74,O243+(L244-O243)*$O$74)","v":2.5720738888888888},2.5520738888888888,2.2000000000000002,2.2000000000000002,0,0,0,0,0,0,0,0,0]
[1,1.6900000000000013,2.4703200000000032,1.3105000000000029,2.5765349999999998,2.5915349999999999,2.4703200000000032,2.200499999999999,{"$f":"IF($B$7=constants!$C$60,G245,IF($B$8=constants!$C$60,C245,E245))","v":2.5765349999999998},{"$f":"IF($B$7=constants!$C$60,H245,IF($B$8=constants!$C$60,D245,F245))","v":2.5915349999999999},1,2.5765349999999998,2.6,2.5765349999999998,{"$f":"IF(OR($B$22=constants!$B$60,AND(I245>$B$12,$B$12<>-1)),O244+(N245-O244)*$O$74,O244+(L245-O244)*$O$74)","v":2.5760888888888887},2.5560888888888886,2.2000000000000002,2.2000000000000002,0,0,0,0,0,0,0,0,0]
[1,1.7000000000000013,2.496600000000003,1.3105000000000029,2.5805499999999997,2.5955499999999998,2.496600000000003,2.200499999999999,{"$f":"IF($B$7=constants!$C$60,G246,IF($B$8=constants!$C$60,C246,E246))","v":2.5805499999999997},{"$f":"IF($B$7=constants!$C$60,H246,IF($B$8=constants!$C$60,D246,F246))","v":2.5955499999999998},1,2.5805499999999997,2.6,2.5805499999999997,{"$f":"IF(OR($B$22=constants!$B$60,AND(I246>$B$12,$B$12<>-1)),O245+(N246-O245)*$O$74,O245+(L246-O245)*$O$74)","v":2.5801038888888885},2.5601038888888885,2.2000000000000002,2.2000000000000002,0,0,0,0,0,0,0,0,0]
[1,1.7100000000000013,2.5228800000000029,1.3105000000000029,2.584565,2.5995650000000001,2.5228800000000029,2.200499999999999,{"$f":"IF($B$7=constants!$C$60,G247,IF($B$8=constants!$C$60,C247,E247))","v":2.584565},{"$f":"IF($B$7=constants!$C$60,H247,IF($B$8=constants!$C$60,D247,F247))","v":2.5995650000000001},1,2.584565,2.6,2.584565,{"$f":"IF(OR($B$22=constants!$B$60,AND(I247>$B$12,$B$12<>-1)),O246+(N247-O246)*$O$74,O246+(L247-O246)*$O$74)","v":2.5841188888888889},2.5641188888888888,2.2000000000000002,2.2000000000000002,0,0,0,0,0,0,0,0,0]
[1,1.7200000000000013,2.5491600000000036,1.3105000000000029,2.5885799999999999,2.60358,2.5491600000000036,2.200499999999999,{"$f":"IF($B$7=constants!$C$60,G248,IF($B$8=constants!$C$60,C248,E248))","v":2.5885799999999999},{"$f":"IF($B$7=constants!$C$60,H248,IF($B$8=constants!$C$60,D248,F248))","v":2.60358},1,2.5885799999999999,2.6,2.5885799999999999,{"$f":"IF(OR($B$22=constants!$B$60,AND(I248>$B$12,$B$12<>-1)),O247+(N248-O247)*$O$74,O247+(L248-O247)*$O$74)","v":2.5881338888888887},2.5681338888888887,2.2000000000000002,2.2000000000000002,0,0,0,0,0,0,0,0,0]
[1,1.7300000000000013,2.5754400000000035,1.3105000000000029,2.5925950000000002,2.6075950000000003,2.5754400000000035,2.200499999999999,{"$f":"IF($B$7=constants!$C$60,G249,IF($B$8=constants!$C$60,C249,E249))","v":2.5925950000000002},{"$f":"IF($B$7=constants!$C$60,H249,IF($B$8=constants!$C$60,D249,F249))","v":2.6075950000000003},1,2.5925950000000002,2.6,2.5925950000000002,{"$f":"IF(OR($B$22=constants!$B$60,AND(I249>$B$12,$B$12<>-1)),O248+(N249-O248)*$O$74,O248+(L249-O248)*$O$74)","v":2.5921488888888891},2.572148888888889,2.2000000000000002,2.2000000000000002,0,0,0,0,0,0,0,0,0]
[1,1.7400000000000013,2.6017200000000034,1.3105000000000029,2.5966100000000001,2.6116100000000002,2.6017200000000034,2.200499999999999,{"$f":"IF($B$7=constants!$C$60,G250,IF($B$8=constants!$C$60,C250,E250))","v":2.5966100000000001},{"$f":"IF($B$7=constants!$C$60,H250,IF($B$8=constants!$C$60,D250,F250))","v":2.6116100000000002},1,2.5966100000000001,2.6,2.5966100000000001,{"$f":"IF(OR($B$22=constants!$B$60,AND(I250>$B$12,$B$12<>-1)),O249+(N250-O249)*$O$74,O249+(L250-O249)*$O$74)","v":2.5961638888888889},2.5761638888888889,2.2000000000000002,2.2000000000000002,0,0,0,0,0,0,0,0,0]
[1,1.7500000000000013,{"$f":"$D$23*B251+$D$24","v":2.6279999999999966},{"$f":"$G$23*$B251+$G$24","v":1.3105000000000029},2.600625,2.6156250000000001,{"$f":"B251*$H$56+$H$57","v":2.6279999999999979},2.200499999999999,{"$f":"IF($B$7=constants!$C$60,G251,IF($B$8=constants!$C$60,C251,E251))","v":2.600625},{"$f":"IF($B$7=constants!$C$60,H251,IF($B$8=constants!$C$60,D251,F251))","v":2.6156250000000001},1,2.600625,2.6,2.6,{"$f":"IF(OR($B$22=constants!$B$60,AND(I251>$B$12,$B$12<>-1)),O250+(N251-O250)*$O$74,O250+(L251-O250)*$O$74)","v":2.6001788888888888},2.5801788888888888,2.2000000000000002,2.2000000000000002,0,0,0,0,0,0,0,0,0]
[1,1.7600000000000013,{"$f":"$D$23*B252+$D$24","v":2.6017199999999967},{"$f":"$G$23*$B252+$G$24","v":1.3369200000000028},2.6046399999999998,2.61964,{"$f":"B252*$H$56+$H$57","v":2.6102999999999978},2.200499999999999,{"$f":"IF($B$7=constants!$C$60,G252,IF($B$8=constants!$C$60,C252,E252))","v":2.6046399999999998},{"$f":"IF($B$7=constants!$C$60,H252,IF($B$8=constants!$C$60,D252,F252))","v":2.61964},1,2.6046399999999998,2.6,2.6,{"$f":"IF(OR($B$22=constants!$B$60,AND(I252>$B$12,$B$12<>-1)),O251+(N252-O251)*$O$74,O251+(L252-O251)*$O$74)","v":2.6041938888888887},2.5841938888888887,2.2000000000000002,2.2000000000000002,0,0,0,0,0,0,0,0,0]
[1,1.7700000000000014,2.575439999999996,1.3633400000000027,2.6086549999999997,2.6236549999999998,2.5925999999999978,2.200499999999999,{"$f":"IF($B$7=constants!$C$60,G253,IF($B$8=constants!$C$60,C253,E253))","v":2.6086549999999997},{"$f":"IF($B$7=constants!$C$60,H253,IF($B$8=constants!$C$60,D253,F253))","v":2.6236549999999998},1,2.6086549999999997,2.6,2.6,{"$f":"IF(OR($B$22=constants!$B$60,AND(I253>$B$12,$B$12<>-1)),O252+(N253-O252)*$O$74,O252+(L253-O252)*$O$74)","v":2.6082088888888886},2.5882088888888886,2.2000000000000002,2.2000000000000002,0,0,0,0,0,0,0,0,0]
[1,1.7800000000000014,2.5491599999999961,1.3897600000000025,2.61267,2.6276700000000002,2.5748999999999977,2.200499999999999,{"$f":"IF($B$7=constants!$C$60,G254,IF($B$8=constants!$C$60,C254,E254))","v":2.61267},{"$f":"IF($B$7=constants!$C$60,H254,IF($B$8=constants!$C$60,D254,F254))","v":2.6276700000000002},1,2.61267,2.6,2.6,{"$f":"IF(OR($B$22=constants!$B$60,AND(I254>$B$12,$B$12<>-1)),O253+(N254-O253)*$O$74,O253+(L254-O253)*$O$74)","v":2.6122238888888889},2.5922238888888889,2.2000000000000002,2.2000000000000002,0,0,0,0,0,0,0,0,0]
[1,1.7900000000000014,2.5228799999999962,1.4161800000000033,2.6166849999999999,2.6316850000000001,2.5571999999999977,2.200499999999999,{"$f":"IF($B$7=constants!$C$60,G255,IF($B$8=constants!$C$60,C255,E255))","v":2.6166849999999999},{"$f":"IF($B$7=constants!$C$60,H255,IF($B$8=constants!$C$60,D255,F255))","v":2.6316850000000001},1,2.6166849999999999,2.6,2.6,{"$f":"IF(OR($B$22=constants!$B$60,AND(I255>$B$12,$B$12<>-1)),O254+(N255-O254)*$O$74,O254+(L255-O254)*$O$74)","v":2.6162388888888888},2.5962388888888888,2.2000000000000002,2.2000000000000002,0,0,0,0,0,0,0,0,0]
[1,1.8000000000000014,2.4965999999999964,1.4426000000000032,2.6206999999999998,2.6356999999999999,2.5394999999999976,2.200499999999999,{"$f":"IF($B$7=constants!$C$60,G256,IF($B$8=constants!$C$60,C256,E256))","v":2.6206999999999998},{"$f":"IF($B$7=constants!$C$60,H256,IF($B$8=constants!$C$60,D256,F256))","v":2.6356999999999999},1,2.6206999999999998,2.6,2.6,{"$f":"IF(OR($B$22=constants!$B$60,AND(I256>$B$12,$B$12<>-1)),O255+(N256-O255)*$O$74,O255+(L256-O255)*$O$74)","v":2.6202538888888887},2.6002538888888886,2.2000000000000002,2.2000000000000002,0,0,0,0,0,0,0,0,0]
[1,1.8100000000000014,2.4703199999999965,1.4690200000000031,2.6247150000000001,2.6397150000000003,2.5217999999999976,2.200499999999999,{"$f":"IF($B$7=constants!$C$60,G257,IF($B$8=constants!$C$60,C257,E257))","v":2.6247150000000001},{"$f":"IF($B$7=constants!$C$60,H257,IF($B$8=constants!$C$60,D257,F257))","v":2.6397150000000003},1,2.6247150000000001,2.6,2.6,{"$f":"IF(OR($B$22=constants!$B$60,AND(I257>$B$12,$B$12<>-1)),O256+(N257-O256)*$O$74,O256+(L257-O256)*$O$74)","v":2.624268888888889},2.604268888888889,2.2000000000000002,2.2000000000000002,0,0,0,0,0,0,0,0,0]
[1,1.8200000000000014,2.4440399999999967,1.495440000000003,2.62873,2.6437300000000001,2.5040999999999976,2.200499999999999,{"$f":"IF($B$7=constants!$C$60,G258,IF($B$8=constants!$C$60,C258,E258))","v":2.62873},{"$f":"IF($B$7=constants!$C$60,H258,IF($B$8=constants!$C$60,D258,F258))","v":2.6437300000000001},1,2.62873,2.6,{"$f":"IF(M258>I258,L258,M258)","v":2.6},{"$f":"IF(OR($B$22=constants!$B$60,AND(I258>$B$12,$B$12<>-1)),O257+(N258-O257)*$O$74,O257+(L258-O257)*$O$74)","v":2.6282838888888889},2.6082838888888888,2.2000000000000002,2.2000000000000002,0,0,0,0,0,0,0,0,0]
[1,1.8300000000000014,2.4177599999999959,1.5218600000000029,2.6327449999999999,2.647745,2.4863999999999975,2.200499999999999,{"$f":"IF($B$7=constants!$C$60,G259,IF($B$8=constants!$C$60,C259,E259))","v":2.6327449999999999},{"$f":"IF($B$7=constants!$C$60,H259,IF($B$8=constants!$C$60,D259,F259))","v":2.647745},1,2.6327449999999999,2.6,2.6,{"$f":"IF(OR($B$22=constants!$B$60,AND(I259>$B$12,$B$12<>-1)),O258+(N259-O258)*$O$74,O258+(L259-O258)*$O$74)","v":2.6322988888888887},2.6122988888888887,2.2000000000000002,2.2000000000000002,0,0,0,0,0,0,0,0,0]
[1,1.8400000000000014,2.3914799999999961,1.5482800000000028,2.6367599999999998,2.6517599999999999,2.4686999999999975,2.200499999999999,{"$f":"IF($B$7=constants!$C$60,G260,IF($B$8=constants!$C$60,C260,E260))","v":2.6367599999999998},{"$f":"IF($B$7=constants!$C$60,H260,IF($B$8=constants!$C$60,D260,F260))","v":2.6517599999999999},1,2.6367599999999998,2.6,2.6,{"$f":"IF(OR($B$22=constants!$B$60,AND(I260>$B$12,$B$12<>-1)),O259+(N260-O259)*$O$74,O259+(L260-O259)*$O$74)","v":2.6363138888888886},2.6163138888888886,2.2000000000000002,2.2000000000000002,0,0,0,0,0,0,0,0,0]
[1,1.8500000000000014,2.3651999999999962,1.5747000000000027,2.6407750000000001,2.6557750000000002,2.4509999999999974,2.200499999999999,{"$f":"IF($B$7=constants!$C$60,G261,IF($B$8=constants!$C$60,C261,E261))","v":2.6407750000000001},{"$f":"IF($B$7=constants!$C$60,H261,IF($B$8=constants!$C$60,D261,F261))","v":2.6557750000000002},1,2.6407750000000001,2.6,2.6,{"$f":"IF(OR($B$22=constants!$B$60,AND(I261>$B$12,$B$12<>-1)),O260+(N261-O260)*$O$74,O260+(L261-O260)*$O$74)","v":2.6403288888888889},2.6203288888888889,2.2000000000000002,2.2000000000000002,0,0,0,0,0,0,0,0,0]
[1,1.8600000000000014,2.3389199999999963,1.6011200000000034,2.64479,2.6597900000000001,2.4332999999999974,2.200499999999999,{"$f":"IF($B$7=constants!$C$60,G262,IF($B$8=constants!$C$60,C262,E262))","v":2.64479},{"$f":"IF($B$7=constants!$C$60,H262,IF($B$8=constants!$C$60,D262,F262))","v":2.6597900000000001},1,2.64479,2.6,2.6,{"$f":"IF(OR($B$22=constants!$B$60,AND(I262>$B$12,$B$12<>-1)),O261+(N262-O261)*$O$74,O261+(L262-O261)*$O$74)","v":2.6443438888888888},2.6243438888888888,2.2000000000000002,2.2000000000000002,0,0,0,0,0,0,0,0,0]
[1,1.8700000000000014,2.3126399999999965,1.6275400000000033,2.6488049999999999,2.663805,2.4155999999999973,2.200499999999999,{"$f":"IF($B$7=constants!$C$60,G263,IF($B$8=constants!$C$60,C263,E263))","v":2.6488049999999999},{"$f":"IF($B$7=constants!$C$60,H263,IF($B$8=constants!$C$60,D263,F263))","v":2.663805},1,2.6488049999999999,2.6,2.6,{"$f":"IF(OR($B$22=constants!$B$60,AND(I263>$B$12,$B$12<>-1)),O262+(N263-O262)*$O$74,O262+(L263-O262)*$O$74)","v":2.6483588888888887},2.6283588888888887,2.2000000000000002,2.2000000000000002,0,0,0,0,0,0,0,0,0]
[1,1.8800000000000014,2.2863599999999966,1.6539600000000032,2.6528200000000002,2.6678200000000003,2.3978999999999973,2.200499999999999,{"$f":"IF($B$7=constants!$C$60,G264,IF($B$8=constants!$C$60,C264,E264))","v":2.6528200000000002},{"$f":"IF($B$7=constants!$C$60,H264,IF($B$8=constants!$C$60,D264,F264))","v":2.6678200000000003},1,2.6528200000000002,2.6,2.6,{"$f":"IF(OR($B$22=constants!$B$60,AND(I264>$B$12,$B$12<>-1)),O263+(N264-O263)*$O$74,O263+(L264-O263)*$O$74)","v":2.652373888888889},2.632373888888889,2.2000000000000002,2.2000000000000002,0,0,0,0,0,0,0,0,0]
[1,1.8900000000000015,2.2600799999999959,1.6803800000000031,2.6568350000000001,2.6718350000000002,2.3801999999999972,2.200499999999999,{"$f":"IF($B$7=constants!$C$60,G265,IF($B$8=constants!$C$60,C265,E265))","v":2.6568350000000001},{"$f":"IF($B$7=constants!$C$60,H265,IF($B$8=constants!$C$60,D265,F265))","v":2.6718350000000002},1,2.6568350000000001,2.6,2.6,{"$f":"IF(OR($B$22=constants!$B$60,AND(I265>$B$12,$B$12<>-1)),O264+(N265-O264)*$O$74,O264+(L265-O264)*$O$74)","v":2.6563888888888889},2.6363888888888889,2.2000000000000002,2.2000000000000002,0,0,0,0,0,0,0,0,0]
[1,1.9000000000000015,2.233799999999996,1.706800000000003,2.6608499999999999,2.6758500000000001,2.3624999999999972,2.200499999999999,{"$f":"IF($B$7=constants!$C$60,G266,IF($B$8=constants!$C$60,C266,E266))","v":2.6608499999999999},{"$f":"IF($B$7=constants!$C$60,H266,IF($B$8=constants!$C$60,D266,F266))","v":2.6758500000000001},1,2.6608499999999999,2.6,2.6,{"$f":"IF(OR($B$22=constants!$B$60,AND(I266>$B$12,$B$12<>-1)),O265+(N266-O265)*$O$74,O265+(L266-O265)*$O$74)","v":2.6604038888888888},2.6404038888888888,2.2000000000000002,2.2000000000000002,0,0,0,0,0,0,0,0,0]
[1,1.9100000000000015,2.2075199999999962,1.7332200000000029,2.6648649999999998,2.6798649999999999,2.3447999999999971,2.200499999999999,{"$f":"IF($B$7=constants!$C$60,G267,IF($B$8=constants!$C$60,C267,E267))","v":2.6648649999999998},{"$f":"IF($B$7=constants!$C$60,H267,IF($B$8=constants!$C$60,D267,F267))","v":2.6798649999999999},1,2.6648649999999998,2.6,2.6,{"$f":"IF(OR($B$22=constants!$B$60,AND(I267>$B$12,$B$12<>-1)),O266+(N267-O266)*$O$74,O266+(L267-O266)*$O$74)","v":2.6644188888888887},2.6444188888888887,2.2000000000000002,2.2000000000000002,0,0,0,0,0,0,0,0,0]
[1,1.9200000000000015,2.1812399999999963,1.7596400000000028,2.6688800000000001,2.6838800000000003,2.3270999999999971,2.200499999999999,{"$f":"IF($B$7=constants!$C$60,G268,IF($B$8=constants!$C$60,C268,E268))","v":2.6688800000000001},{"$f":"IF($B$7=constants!$C$60,H268,IF($B$8=constants!$C$60,D268,F268))","v":2.6838800000000003},1,2.6688800000000001,2.6,2.6,{"$f":"IF(OR($B$22=constants!$B$60,AND(I268>$B$12,$B$12<>-1)),O267+(N268-O267)*$O$74,O267+(L268-O267)*$O$74)","v":2.668433888888889},2.648433888888889,2.2000000000000002,2.2000000000000002,0,0,0,0,0,0,0,0,0]
[{"$f":"IF(B269<=100,1,IF(B269<=200,2,3))","v":1},1.9300000000000015,2.1549599999999964,1.7860600000000035,2.672895,2.6878950000000001,2.309399999999997,2.200499999999999,{"$f":"IF($B$7=constants!$C$60,G269,IF($B$8=constants!$C$60,C269,E269))","v":2.672895},{"$f":"IF($B$7=constants!$C$60,H269,IF($B$8=constants!$C$60,D269,F269))","v":2.6878950000000001},1,2.672895,2.6,2.6,{"$f":"IF(OR($B$22=constants!$B$60,AND(I269>$B$12,$B$12<>-1)),O268+(N269-O268)*$O$74,O268+(L269-O268)*$O$74)","v":2.6724488888888889},{"$f":"IF(O269=0,0,O269-$P$72)","v":2.6524488888888889},2.2000000000000002,2.2000000000000002,{"$f":"S$72*IF(S$71=0,$L269,IF(S$71=1,$R269,IF($B$12=-1,$L269,IF($I269>$B$12,$R269,$L269))))","v":0},0,0,0,0,0,{"$f":"IF(V269=0,0,V269-Y$72)","v":0},{"$f":"IF(W269=0,0,W269-Z$72)","v":0},{"$f":"IF(X269=0,0,X269-AA$72)","v":0}]
[1,{"$f":"B269+0.01","v":1.9400000000000015},2.1286799999999957,1.8124800000000034,2.6769099999999999,2.69191,2.291699999999997,2.200499999999999,{"$f":"IF($B$7=constants!$C$60,G270,IF($B$8=constants!$C$60,C270,E270))","v":2.6769099999999999},{"$f":"IF($B$7=constants!$C$60,H270,IF($B$8=constants!$C$60,D270,F270))","v":2.69191},{"$f":"IF(AND(I270>$B$16,K269=0),1,IF(AND(I270<$B$17,K269=1),0,K269))","v":1},2.6769099999999999,2.6,2.6,{"$f":"IF(OR($B$22=constants!$B$60,AND(I270>$B$12,$B$12<>-1)),O269+(N270-O269)*$O$74,O269+(L270-O269)*$O$74)","v":2.6764638888888888},2.6564638888888887,2.2000000000000002,{"$f":"IF(Q270>I270,I270,Q270)","v":2.2000000000000002},0,0,0,{"$f":"V269+(S270-V$72-V269)*V$74","v":0},{"$f":"W269+(T270-W$72-W269)*W$74","v":0},{"$f":"X269+(U270-X$72-X269)*X$74","v":0},0,0,0]
[1,1.9500000000000015,2.1023999999999958,1.8389000000000033,2.6809250000000002,2.6959250000000003,2.2739999999999969,2.200499999999999,{"$f":"IF($B$7=constants!$C$60,G271,IF($B$8=constants!$C$60,C271,E271))","v":2.6809250000000002},{"$f":"IF($B$7=constants!$C$60,H271,IF($B$8=constants!$C$60,D271,F271))","v":2.6959250000000003},1,2.6809250000000002,2.6,2.6,{"$f":"IF(OR($B$22=constants!$B$60,AND(I271>$B$12,$B$12<>-1)),O270+(N271-O270)*$O$74,O270+(L271-O270)*$O$74)","v":2.6804788888888891},2.6604788888888891,2.2000000000000002,2.2000000000000002,0,0,0,0,0,0,0,0,0]
[1,1.9600000000000015,2.076119999999996,1.8653200000000032,2.6849400000000001,2.6999400000000002,2.2562999999999969,2.200499999999999,{"$f":"IF($B$7=constants!$C$60,G272,IF($B$8=constants!$C$60,C272,E272))","v":2.6849400000000001},{"$f":"IF($B$7=constants!$C$60,H272,IF($B$8=constants!$C$60,D272,F272))","v":2.6999400000000002},1,2.6849400000000001,2.6,2.6,{"$f":"IF(OR($B$22=constants!$B$60,AND(I272>$B$12,$B$12<>-1)),O271+(N272-O271)*$O$74,O271+(L272-O271)*$O$74)","v":2.684493888888889},2.6644938888888889,2.2000000000000002,2.2000000000000002,0,0,0,0,0,0,0,0,0]
[1,1.9700000000000015,2.0498399999999961,1.8917400000000031,2.688955,{"$f":"E273+$F$74","v":2.7039550000000001},2.2385999999999968,2.200499999999999,{"$f":"IF($B$7=constants!$C$60,G273,IF($B$8=constants!$C$60,C273,E273))","v":2.688955},{"$f":"IF($B$7=constants!$C$60,H273,IF($B$8=constants!$C$60,D273,F273))","v":2.7039550000000001},1,2.688955,2.6,2.6,{"$f":"IF(OR($B$22=constants!$B$60,AND(I273>$B$12,$B$12<>-1)),O272+(N273-O272)*$O$74,O272+(L273-O272)*$O$74)","v":2.6885088888888888},2.6685088888888888,2.2000000000000002,2.2000000000000002,0,0,0,0,0,0,0,0,0]
[1,1.9800000000000015,2.0235599999999963,1.918160000000003,2.6929699999999999,2.70797,2.2208999999999968,2.200499999999999,{"$f":"IF($B$7=constants!$C$60,G274,IF($B$8=constants!$C$60,C274,E274))","v":2.6929699999999999},{"$f":"IF($B$7=constants!$C$60,H274,IF($B$8=constants!$C$60,D274,F274))","v":2.70797},1,2.6929699999999999,2.6,2.6,{"$f":"IF(OR($B$22=constants!$B$60,AND(I274>$B$12,$B$12<>-1)),O273+(N274-O273)*$O$74,O273+(L274-O273)*$O$74)","v":2.6925238888888887},2.6725238888888887,2.2000000000000002,2.2000000000000002,0,0,0,0,0,0,0,0,0]
[1,1.9900000000000015,1.9972799999999964,1.9445800000000029,2.6969850000000002,2.7119850000000003,2.2031999999999967,2.200499999999999,{"$f":"IF($B$7=constants!$C$60,G275,IF($B$8=constants!$C$60,C275,E275))","v":2.6969850000000002},{"$f":"IF($B$7=constants!$C$60,H275,IF($B$8=constants!$C$60,D275,F275))","v":2.7119850000000003},1,2.6969850000000002,2.6,2.6,{"$f":"IF(OR($B$22=constants!$B$60,AND(I275>$B$12,$B$12<>-1)),O274+(N275-O274)*$O$74,O274+(L275-O274)*$O$74)","v":2.696538888888889},2.676538888888889,2.2000000000000002,2.2000000000000002,0,0,0,0,0,0,0,0,0]
[1,2.0000000000000013,{"$f":"$D$29*B276+$D$30","v":1.9710000000000032},1.9710000000000027,{"$f":"$K$15*$B276+$K$16","v":2.7009999999999996},2.7159999999999997,2.1854999999999971,{"$f":"$H$63*B276+$H$64","v":2.200499999999999},{"$f":"IF($B$7=constants!$C$60,G276,IF($B$8=constants!$C$60,C276,E276))","v":2.7009999999999996},{"$f":"IF($B$7=constants!$C$60,H276,IF($B$8=constants!$C$60,D276,F276))","v":2.7159999999999997},1,2.7009999999999996,2.6,2.6,{"$f":"IF(OR($B$22=constants!$B$60,AND(I276>$B$12,$B$12<>-1)),O275+(N276-O275)*$O$74,O275+(L276-O275)*$O$74)","v":2.7005538888888885},2.6805538888888885,2.2000000000000002,2.2000000000000002,0,0,0,0,0,0,0,0,0]
[1,2.0100000000000011,{"$f":"$D$29*B277+$D$30","v":2.0002000000000026},{"$f":"C277+$D$74","v":2.0152000000000028},{"$f":"$K$15*$B277+$K$16","v":2.6995399999999994},2.7145399999999995,{"$f":"(H277-$H$74)/(1-EXP(-1/G$74))*(1-EXP(-$B277/G$74))","v":2.1844999999999986},2.1994999999999987,{"$f":"IF($B$7=constants!$C$60,G277,IF($B$8=constants!$C$60,C277,E277))","v":2.6995399999999994},{"$f":"IF($B$7=constants!$C$60,H277,IF($B$8=constants!$C$60,D277,F277))","v":2.7145399999999995},1,2.6995399999999994,2.6,2.6,{"$f":"IF(OR($B$22=constants!$B$60,AND(I277>$B$12,$B$12<>-1)),O276+(N277-O276)*$O$74,O276+(L277-O276)*$O$74)","v":2.6996413888888884},2.6796413888888884,2.2000000000000002,2.2000000000000002,0,0,0,0,0,0,0,0,0]
[1,2.0200000000000009,2.0294000000000021,2.0444000000000022,2.6980799999999996,2.7130799999999997,{"$f":"(H278-$H$74)/(1-EXP(-1/G$74))*(1-EXP(-$B278/G$74))","v":2.1834999999999987},2.1984999999999988,{"$f":"IF($B$7=constants!$C$60,G278,IF($B$8=constants!$C$60,C278,E278))","v":2.6980799999999996},{"$f":"IF($B$7=constants!$C$60,H278,IF($B$8=constants!$C$60,D278,F278))","v":2.7130799999999997},1,2.6980799999999996,2.6,2.6,{"$f":"IF(OR($B$22=constants!$B$60,AND(I278>$B$12,$B$12<>-1)),O277+(N278-O277)*$O$74,O277+(L278-O277)*$O$74)","v":2.6982361388888885},2.6782361388888885,2.2000000000000002,2.2000000000000002,0,0,0,0,0,0,0,0,0]
[1,2.0300000000000007,2.0586000000000015,2.0736000000000017,2.6966199999999994,2.7116199999999995,2.1824999999999988,2.1974999999999989,{"$f":"IF($B$7=constants!$C$60,G279,IF($B$8=constants!$C$60,C279,E279))","v":2.6966199999999994},{"$f":"IF($B$7=constants!$C$60,H279,IF($B$8=constants!$C$60,D279,F279))","v":2.7116199999999995},1,2.6966199999999994,2.6,2.6,{"$f":"IF(OR($B$22=constants!$B$60,AND(I279>$B$12,$B$12<>-1)),O278+(N279-O278)*$O$74,O278+(L279-O278)*$O$74)","v":2.6967816138888883},2.6767816138888882,2.2000000000000002,2.2000000000000002,0,0,0,0,0,0,0,0,0]
[1,2.0400000000000005,2.087800000000001,2.1028000000000011,2.6951599999999996,2.7101599999999997,2.1814999999999989,2.196499999999999,{"$f":"IF($B$7=constants!$C$60,G280,IF($B$8=constants!$C$60,C280,E280))","v":2.6951599999999996},{"$f":"IF($B$7=constants!$C$60,H280,IF($B$8=constants!$C$60,D280,F280))","v":2.7101599999999997},1,2.6951599999999996,2.6,2.6,{"$f":"IF(OR($B$22=constants!$B$60,AND(I280>$B$12,$B$12<>-1)),O279+(N280-O279)*$O$74,O279+(L280-O279)*$O$74)","v":2.6953221613888885},2.6753221613888885,2.2000000000000002,2.2000000000000002,0,0,0,0,0,0,0,0,0]
[1,2.0500000000000003,2.1170000000000004,2.1320000000000006,2.6936999999999998,2.7086999999999999,2.180499999999999,2.1954999999999991,{"$f":"IF($B$7=constants!$C$60,G281,IF($B$8=constants!$C$60,C281,E281))","v":2.6936999999999998},{"$f":"IF($B$7=constants!$C$60,H281,IF($B$8=constants!$C$60,D281,F281))","v":2.7086999999999999},1,2.6936999999999998,2.6,2.6,{"$f":"IF(OR($B$22=constants!$B$60,AND(I281>$B$12,$B$12<>-1)),O280+(N281-O280)*$O$74,O280+(L281-O280)*$O$74)","v":2.6938622161388888},2.6738622161388887,2.2000000000000002,2.2000000000000002,0,0,0,0,0,0,0,0,0]
[1,2.06,2.1461999999999999,2.1612,2.6922399999999995,2.7072399999999996,2.1794999999999987,2.1944999999999988,{"$f":"IF($B$7=constants!$C$60,G282,IF($B$8=constants!$C$60,C282,E282))","v":2.6922399999999995},{"$f":"IF($B$7=constants!$C$60,H282,IF($B$8=constants!$C$60,D282,F282))","v":2.7072399999999996},1,2.6922399999999995,2.6,2.6,{"$f":"IF(OR($B$22=constants!$B$60,AND(I282>$B$12,$B$12<>-1)),O281+(N282-O281)*$O$74,O281+(L282-O281)*$O$74)","v":2.6924022216138885},2.6724022216138885,2.2000000000000002,2.2000000000000002,0,0,0,0,0,0,0,0,0]
[1,2.0699999999999998,2.1753999999999993,2.1903999999999995,2.6907799999999997,2.7057799999999999,2.1784999999999988,2.1934999999999989,{"$f":"IF($B$7=constants!$C$60,G283,IF($B$8=constants!$C$60,C283,E283))","v":2.6907799999999997},{"$f":"IF($B$7=constants!$C$60,H283,IF($B$8=constants!$C$60,D283,F283))","v":2.7057799999999999},1,2.6907799999999997,2.6,2.6,{"$f":"IF(OR($B$22=constants!$B$60,AND(I283>$B$12,$B$12<>-1)),O282+(N283-O282)*$O$74,O282+(L283-O282)*$O$74)","v":2.6909422221613886},2.6709422221613885,2.2000000000000002,2.2000000000000002,0,0,0,0,0,0,0,0,0]
[1,2.0799999999999996,2.2045999999999988,2.2195999999999989,2.6893199999999995,2.7043199999999996,2.1774999999999989,2.192499999999999,{"$f":"IF($B$7=constants!$C$60,G284,IF($B$8=constants!$C$60,C284,E284))","v":2.6893199999999995},{"$f":"IF($B$7=constants!$C$60,H284,IF($B$8=constants!$C$60,D284,F284))","v":2.7043199999999996},1,2.6893199999999995,2.6,2.6,{"$f":"IF(OR($B$22=constants!$B$60,AND(I284>$B$12,$B$12<>-1)),O283+(N284-O283)*$O$74,O283+(L284-O283)*$O$74)","v":2.6894822222161383},2.6694822222161383,2.2000000000000002,2.2000000000000002,0,0,0,0,0,0,0,0,0]
[1,2.0899999999999994,2.2337999999999982,2.2487999999999984,2.6878599999999997,2.7028599999999998,2.176499999999999,2.1914999999999991,{"$f":"IF($B$7=constants!$C$60,G285,IF($B$8=constants!$C$60,C285,E285))","v":2.6878599999999997},{"$f":"IF($B$7=constants!$C$60,H285,IF($B$8=constants!$C$60,D285,F285))","v":2.7028599999999998},1,2.6878599999999997,2.6,2.6,{"$f":"IF(OR($B$22=constants!$B$60,AND(I285>$B$12,$B$12<>-1)),O284+(N285-O284)*$O$74,O284+(L285-O284)*$O$74)","v":2.6880222222216137},2.6680222222216137,2.2000000000000002,2.2000000000000002,0,0,0,0,0,0,0,0,0]
[1,2.0999999999999992,2.2629999999999968,2.2779999999999969,2.6863999999999999,2.7014,2.1754999999999991,2.1904999999999992,{"$f":"IF($B$7=constants!$C$60,G286,IF($B$8=constants!$C$60,C286,E286))","v":2.6863999999999999},{"$f":"IF($B$7=constants!$C$60,H286,IF($B$8=constants!$C$60,D286,F286))","v":2.7014},1,2.6863999999999999,2.6,2.6,{"$f":"IF(OR($B$22=constants!$B$60,AND(I286>$B$12,$B$12<>-1)),O285+(N286-O285)*$O$74,O285+(L286-O285)*$O$74)","v":2.6865622222221615},2.6665622222221614,2.2000000000000002,2.2000000000000002,0,0,0,0,0,0,0,0,0]
[1,2.109999999999999,2.2921999999999962,2.3071999999999964,2.6849399999999997,2.6999399999999998,2.1744999999999988,2.1894999999999989,{"$f":"IF($B$7=constants!$C$60,G287,IF($B$8=constants!$C$60,C287,E287))","v":2.6849399999999997},{"$f":"IF($B$7=constants!$C$60,H287,IF($B$8=constants!$C$60,D287,F287))","v":2.6999399999999998},1,2.6849399999999997,2.6,2.6,{"$f":"IF(OR($B$22=constants!$B$60,AND(I287>$B$12,$B$12<>-1)),O286+(N287-O286)*$O$74,O286+(L287-O286)*$O$74)","v":2.6851022222222158},2.6651022222222158,2.2000000000000002,2.2000000000000002,0,0,0,0,0,0,0,0,0]
[1,2.1199999999999988,2.3213999999999957,2.3363999999999958,2.6834799999999999,2.69848,2.1734999999999989,2.188499999999999,{"$f":"IF($B$7=constants!$C$60,G288,IF($B$8=constants!$C$60,C288,E288))","v":2.6834799999999999},{"$f":"IF($B$7=constants!$C$60,H288,IF($B$8=constants!$C$60,D288,F288))","v":2.69848},1,2.6834799999999999,2.6,2.6,{"$f":"IF(OR($B$22=constants!$B$60,AND(I288>$B$12,$B$12<>-1)),O287+(N288-O287)*$O$74,O287+(L288-O287)*$O$74)","v":2.6836422222222214},2.6636422222222214,2.2000000000000002,2.2000000000000002,0,0,0,0,0,0,0,0,0]
[1,2.1299999999999986,2.3505999999999951,2.3655999999999953,2.6820199999999996,2.6970199999999998,2.172499999999999,2.1874999999999991,{"$f":"IF($B$7=constants!$C$60,G289,IF($B$8=constants!$C$60,C289,E289))","v":2.6820199999999996},{"$f":"IF($B$7=constants!$C$60,H289,IF($B$8=constants!$C$60,D289,F289))","v":2.6970199999999998},1,2.6820199999999996,2.6,2.6,{"$f":"IF(OR($B$22=constants!$B$60,AND(I289>$B$12,$B$12<>-1)),O288+(N289-O288)*$O$74,O288+(L289-O288)*$O$74)","v":2.682182222222222},2.662182222222222,2.2000000000000002,2.2000000000000002,0,0,0,0,0,0,0,0,0]
[1,2.1399999999999983,2.3797999999999946,2.3947999999999947,2.6805599999999998,2.69556,2.1714999999999991,2.1864999999999992,{"$f":"IF($B$7=constants!$C$60,G290,IF($B$8=constants!$C$60,C290,E290))","v":2.6805599999999998},{"$f":"IF($B$7=constants!$C$60,H290,IF($B$8=constants!$C$60,D290,F290))","v":2.69556},1,2.6805599999999998,2.6,2.6,{"$f":"IF(OR($B$22=constants!$B$60,AND(I290>$B$12,$B$12<>-1)),O289+(N290-O289)*$O$74,O289+(L290-O289)*$O$74)","v":2.6807222222222222},2.6607222222222222,2.2000000000000002,2.2000000000000002,0,0,0,0,0,0,0,0,0]
[1,2.1499999999999981,2.408999999999994,2.4239999999999942,2.6791,2.6941000000000002,2.1704999999999992,2.1854999999999993,{"$f":"IF($B$7=constants!$C$60,G291,IF($B$8=constants!$C$60,C291,E291))","v":2.6791},{"$f":"IF($B$7=constants!$C$60,H291,IF($B$8=constants!$C$60,D291,F291))","v":2.6941000000000002},1,2.6791,2.6,2.6,{"$f":"IF(OR($B$22=constants!$B$60,AND(I291>$B$12,$B$12<>-1)),O290+(N291-O290)*$O$74,O290+(L291-O290)*$O$74)","v":2.6792622222222224},2.6592622222222224,2.2000000000000002,2.2000000000000002,0,0,0,0,0,0,0,0,0]
[1,2.1599999999999979,2.4381999999999935,2.4531999999999936,2.6776399999999998,2.6926399999999999,2.1694999999999989,2.184499999999999,{"$f":"IF($B$7=constants!$C$60,G292,IF($B$8=constants!$C$60,C292,E292))","v":2.6776399999999998},{"$f":"IF($B$7=constants!$C$60,H292,IF($B$8=constants!$C$60,D292,F292))","v":2.6926399999999999},1,2.6776399999999998,2.6,2.6,{"$f":"IF(OR($B$22=constants!$B$60,AND(I292>$B$12,$B$12<>-1)),O291+(N292-O291)*$O$74,O291+(L292-O291)*$O$74)","v":2.6778022222222222},2.6578022222222222,2.2000000000000002,2.2000000000000002,0,0,0,0,0,0,0,0,0]
[1,2.1699999999999977,2.4673999999999929,2.4823999999999931,2.67618,2.6911800000000001,2.168499999999999,2.1834999999999991,{"$f":"IF($B$7=constants!$C$60,G293,IF($B$8=constants!$C$60,C293,E293))","v":2.67618},{"$f":"IF($B$7=constants!$C$60,H293,IF($B$8=constants!$C$60,D293,F293))","v":2.6911800000000001},1,2.67618,2.6,2.6,{"$f":"IF(OR($B$22=constants!$B$60,AND(I293>$B$12,$B$12<>-1)),O292+(N293-O292)*$O$74,O292+(L293-O292)*$O$74)","v":2.6763422222222224},2.6563422222222224,2.2000000000000002,2.2000000000000002,0,0,0,0,0,0,0,0,0]
[1,2.1799999999999975,2.4965999999999924,2.5115999999999925,2.6747199999999998,2.6897199999999999,2.1674999999999991,2.1824999999999992,{"$f":"IF($B$7=constants!$C$60,G294,IF($B$8=constants!$C$60,C294,E294))","v":2.6747199999999998},{"$f":"IF($B$7=constants!$C$60,H294,IF($B$8=constants!$C$60,D294,F294))","v":2.6897199999999999},1,2.6747199999999998,2.6,2.6,{"$f":"IF(OR($B$22=constants!$B$60,AND(I294>$B$12,$B$12<>-1)),O293+(N294-O293)*$O$74,O293+(L294-O293)*$O$74)","v":2.6748822222222222},2.6548822222222221,2.2000000000000002,2.2000000000000002,0,0,0,0,0,0,0,0,0]
[1,2.1899999999999973,2.5257999999999918,2.540799999999992,2.67326,2.6882600000000001,2.1664999999999992,2.1814999999999993,{"$f":"IF($B$7=constants!$C$60,G295,IF($B$8=constants!$C$60,C295,E295))","v":2.67326},{"$f":"IF($B$7=constants!$C$60,H295,IF($B$8=constants!$C$60,D295,F295))","v":2.6882600000000001},1,2.67326,2.6,2.6,{"$f":"IF(OR($B$22=constants!$B$60,AND(I295>$B$12,$B$12<>-1)),O294+(N295-O294)*$O$74,O294+(L295-O294)*$O$74)","v":2.6734222222222224},2.6534222222222223,2.2000000000000002,2.2000000000000002,0,0,0,0,0,0,0,0,0]
[1,2.1999999999999971,2.5549999999999913,2.5699999999999914,2.6718000000000002,2.6868000000000003,2.1654999999999993,2.1804999999999994,{"$f":"IF($B$7=constants!$C$60,G296,IF($B$8=constants!$C$60,C296,E296))","v":2.6718000000000002},{"$f":"IF($B$7=constants!$C$60,H296,IF($B$8=constants!$C$60,D296,F296))","v":2.6868000000000003},1,2.6718000000000002,2.6,2.6,{"$f":"IF(OR($B$22=constants!$B$60,AND(I296>$B$12,$B$12<>-1)),O295+(N296-O295)*$O$74,O295+(L296-O295)*$O$74)","v":2.6719622222222226},2.6519622222222226,2.2000000000000002,2.2000000000000002,0,0,0,0,0,0,0,0,0]
[1,2.2099999999999969,2.5841999999999898,2.59919999999999,2.6703399999999999,2.6853400000000001,2.164499999999999,2.1794999999999991,{"$f":"IF($B$7=constants!$C$60,G297,IF($B$8=constants!$C$60,C297,E297))","v":2.6703399999999999},{"$f":"IF($B$7=constants!$C$60,H297,IF($B$8=constants!$C$60,D297,F297))","v":2.6853400000000001},1,2.6703399999999999,2.6,2.6,{"$f":"IF(OR($B$22=constants!$B$60,AND(I297>$B$12,$B$12<>-1)),O296+(N297-O296)*$O$74,O296+(L297-O296)*$O$74)","v":2.6705022222222223},2.6505022222222223,2.2000000000000002,2.2000000000000002,0,0,0,0,0,0,0,0,0]
[1,2.2199999999999966,2.6133999999999893,2.6283999999999894,2.6688800000000001,2.6838800000000003,2.1634999999999991,2.1784999999999992,{"$f":"IF($B$7=constants!$C$60,G298,IF($B$8=constants!$C$60,C298,E298))","v":2.6688800000000001},{"$f":"IF($B$7=constants!$C$60,H298,IF($B$8=constants!$C$60,D298,F298))","v":2.6838800000000003},1,2.6688800000000001,2.6,2.6,{"$f":"IF(OR($B$22=constants!$B$60,AND(I298>$B$12,$B$12<>-1)),O297+(N298-O297)*$O$74,O297+(L298-O297)*$O$74)","v":2.6690422222222225},2.6490422222222225,2.2000000000000002,2.2000000000000002,0,0,0,0,0,0,0,0,0]
[1,2.2299999999999964,2.6425999999999887,2.6575999999999889,2.6674200000000003,2.6824200000000005,2.1624999999999992,2.1774999999999993,{"$f":"IF($B$7=constants!$C$60,G299,IF($B$8=constants!$C$60,C299,E299))","v":2.6674200000000003},{"$f":"IF($B$7=constants!$C$60,H299,IF($B$8=constants!$C$60,D299,F299))","v":2.6824200000000005},1,2.6674200000000003,2.6,2.6,{"$f":"IF(OR($B$22=constants!$B$60,AND(I299>$B$12,$B$12<>-1)),O298+(N299-O298)*$O$74,O298+(L299-O298)*$O$74)","v":2.6675822222222227},2.6475822222222227,2.2000000000000002,2.2000000000000002,0,0,0,0,0,0,0,0,0]
[1,2.2399999999999962,2.6717999999999882,2.6867999999999883,2.6659600000000001,2.6809600000000002,2.1614999999999993,2.1764999999999994,{"$f":"IF($B$7=constants!$C$60,G300,IF($B$8=constants!$C$60,C300,E300))","v":2.6659600000000001},{"$f":"IF($B$7=constants!$C$60,H300,IF($B$8=constants!$C$60,D300,F300))","v":2.6809600000000002},1,2.6659600000000001,2.6,2.6,{"$f":"IF(OR($B$22=constants!$B$60,AND(I300>$B$12,$B$12<>-1)),O299+(N300-O299)*$O$74,O299+(L300-O299)*$O$74)","v":2.6661222222222225},2.6461222222222225,2.2000000000000002,2.2000000000000002,0,0,0,0,0,0,0,0,0]
[1,2.249999999999996,{"$f":"$D$33*B301+$D$34","v":2.7010000000000005},2.7160000000000006,2.6645000000000003,2.6795000000000004,2.1604999999999994,2.1754999999999995,{"$f":"IF($B$7=constants!$C$60,G301,IF($B$8=constants!$C$60,C301,E301))","v":2.6645000000000003},{"$f":"IF($B$7=constants!$C$60,H301,IF($B$8=constants!$C$60,D301,F301))","v":2.6795000000000004},1,2.6645000000000003,2.6,2.6,{"$f":"IF(OR($B$22=constants!$B$60,AND(I301>$B$12,$B$12<>-1)),O300+(N301-O300)*$O$74,O300+(L301-O300)*$O$74)","v":2.6646622222222227},2.6446622222222227,2.2000000000000002,2.2000000000000002,{"$f":"S$72*IF(S$71=0,$L301,IF(S$71=1,$R301,IF($B$12=-1,$L301,IF($I301>$B$12,$R301,$L301))))","v":0},0,0,0,0,0,0,0,0]
[1,2.2599999999999958,{"$f":"$D$33*B302+$D$34","v":2.6980800000000005},2.7130800000000006,2.6630400000000001,2.6780400000000002,2.1594999999999991,2.1744999999999992,{"$f":"IF($B$7=constants!$C$60,G302,IF($B$8=constants!$C$60,C302,E302))","v":2.6630400000000001},{"$f":"IF($B$7=constants!$C$60,H302,IF($B$8=constants!$C$60,D302,F302))","v":2.6780400000000002},1,2.6630400000000001,2.6,2.6,{"$f":"IF(OR($B$22=constants!$B$60,AND(I302>$B$12,$B$12<>-1)),O301+(N302-O301)*$O$74,O301+(L302-O301)*$O$74)","v":2.6632022222222225},2.6432022222222225,2.2000000000000002,2.2000000000000002,0,0,0,0,0,0,0,0,0]
[1,2.2699999999999956,2.6951600000000004,2.7101600000000006,2.6615800000000003,2.6765800000000004,2.1584999999999992,2.1734999999999993,{"$f":"IF($B$7=constants!$C$60,G303,IF($B$8=constants!$C$60,C303,E303))","v":2.6615800000000003},{"$f":"IF($B$7=constants!$C$60,H303,IF($B$8=constants!$C$60,D303,F303))","v":2.6765800000000004},1,2.6615800000000003,2.6,2.6,{"$f":"IF(OR($B$22=constants!$B$60,AND(I303>$B$12,$B$12<>-1)),O302+(N303-O302)*$O$74,O302+(L303-O302)*$O$74)","v":2.6617422222222227},2.6417422222222227,2.2000000000000002,2.2000000000000002,0,0,0,0,0,0,0,0,0]
[1,2.2799999999999954,2.6922400000000004,2.7072400000000005,2.6601200000000005,2.6751200000000006,2.1574999999999993,2.1724999999999994,{"$f":"IF($B$7=constants!$C$60,G304,IF($B$8=constants!$C$60,C304,E304))","v":2.6601200000000005},{"$f":"IF($B$7=constants!$C$60,H304,IF($B$8=constants!$C$60,D304,F304))","v":2.6751200000000006},1,{"$f":"IF($K304=0,IF($I304>$B$16,L303+($I304-L303)*L$74-J$72,L303-L303/L$74),IF($I304>$B$17,L303+($I304-L303)*L$74-J$72,L303-L303/L$74))","v":2.6601200000000005},2.6,2.6,{"$f":"IF(OR($B$22=constants!$B$60,AND(I304>$B$12,$B$12<>-1)),O303+(N304-O303)*$O$74,O303+(L304-O303)*$O$74)","v":2.6602822222222229},2.6402822222222229,{"$f":"IF($K304=0,IF($I304>$B$16,R303+($B$21-R303)*R$74-R$72,R303-R303/R$74),IF($I304>$B$17,R303+($B$21-R303)*R$74-R$72,R303-R303/R$74))","v":2.2000000000000002},2.2000000000000002,0,0,0,0,0,0,0,0,0]
[1,2.2899999999999952,2.6893200000000004,2.7043200000000005,2.6586600000000002,{"$f":"E305+$F$74","v":2.6736600000000004},2.1564999999999994,2.1714999999999995,{"$f":"IF($B$7=constants!$C$60,G305,IF($B$8=constants!$C$60,C305,E305))","v":2.6586600000000002},{"$f":"IF($B$7=constants!$C$60,H305,IF($B$8=constants!$C$60,D305,F305))","v":2.6736600000000004},1,2.6586600000000002,2.6,2.6,{"$f":"IF(OR($B$22=constants!$B$60,AND(I305>$B$12,$B$12<>-1)),O304+(N305-O304)*$O$74,O304+(L305-O304)*$O$74)","v":2.6588222222222226},2.6388222222222226,2.2000000000000002,2.2000000000000002,0,0,0,0,0,0,0,0,0]
[1,2.2999999999999949,2.6864000000000008,2.7014000000000009,2.6572000000000005,2.6722000000000006,2.1554999999999995,2.1704999999999997,{"$f":"IF($B$7=constants!$C$60,G306,IF($B$8=constants!$C$60,C306,E306))","v":2.6572000000000005},{"$f":"IF($B$7=constants!$C$60,H306,IF($B$8=constants!$C$60,D306,F306))","v":2.6722000000000006},1,2.6572000000000005,{"$f":"IF($K306=0,IF($I306>$B$16,M305+($B$20-M305)*M$74-K$72,M305-M305/M$74),IF($I306>$B$17,M305+($B$20-M305)*M$74-K$72,M305-M305/M$74))","v":2.6},2.6,{"$f":"IF(OR($B$22=constants!$B$60,AND(I306>$B$12,$B$12<>-1)),O305+(N306-O305)*$O$74,O305+(L306-O305)*$O$74)","v":2.6573622222222228},2.6373622222222228,2.2000000000000002,2.2000000000000002,0,0,0,0,0,0,0,0,0]
[1,2.3099999999999947,2.6834800000000008,2.6984800000000009,2.6557400000000007,2.6707400000000008,2.1544999999999992,2.1694999999999993,{"$f":"IF($B$7=constants!$C$60,G307,IF($B$8=constants!$C$60,C307,E307))","v":2.6557400000000007},{"$f":"IF($B$7=constants!$C$60,H307,IF($B$8=constants!$C$60,D307,F307))","v":2.6707400000000008},1,2.6557400000000007,2.6,2.6,{"$f":"IF(OR($B$22=constants!$B$60,AND(I307>$B$12,$B$12<>-1)),O306+(N307-O306)*$O$74,O306+(L307-O306)*$O$74)","v":2.6559022222222231},2.635902222222223,2.2000000000000002,2.2000000000000002,0,0,0,0,0,0,0,0,0]
[1,2.3199999999999945,2.6805600000000007,2.6955600000000008,2.6542800000000004,2.6692800000000005,2.1534999999999993,{"$f":"$H$63*B308+$H$64","v":2.1684999999999994},{"$f":"IF($B$7=constants!$C$60,G308,IF($B$8=constants!$C$60,C308,E308))","v":2.6542800000000004},{"$f":"IF($B$7=constants!$C$60,H308,IF($B$8=constants!$C$60,D308,F308))","v":2.6692800000000005},1,2.6542800000000004,2.6,2.6,{"$f":"IF(OR($B$22=constants!$B$60,AND(I308>$B$12,$B$12<>-1)),O307+(N308-O307)*$O$74,O307+(L308-O307)*$O$74)","v":2.6544422222222228},2.6344422222222228,2.2000000000000002,2.2000000000000002,0,0,0,0,0,0,0,0,0]
[1,2.3299999999999943,2.6776400000000011,{"$f":"C309+$D$74","v":2.6926400000000013},2.6528200000000006,2.6678200000000007,2.1524999999999994,2.1674999999999995,{"$f":"IF($B$7=constants!$C$60,G309,IF($B$8=constants!$C$60,C309,E309))","v":2.6528200000000006},{"$f":"IF($B$7=constants!$C$60,H309,IF($B$8=constants!$C$60,D309,F309))","v":2.6678200000000007},1,2.6528200000000006,2.6,2.6,{"$f":"IF(OR($B$22=constants!$B$60,AND(I309>$B$12,$B$12<>-1)),O308+(N309-O308)*$O$74,O308+(L309-O308)*$O$74)","v":2.652982222222223},2.632982222222223,2.2000000000000002,2.2000000000000002,0,0,0,0,0,0,0,0,0]
[1,2.3399999999999941,2.6747200000000007,2.6897200000000008,2.6513600000000004,2.6663600000000005,2.1514999999999995,2.1664999999999996,{"$f":"IF($B$7=constants!$C$60,G310,IF($B$8=constants!$C$60,C310,E310))","v":2.6513600000000004},{"$f":"IF($B$7=constants!$C$60,H310,IF($B$8=constants!$C$60,D310,F310))","v":2.6663600000000005},1,2.6513600000000004,2.6,2.6,{"$f":"IF(OR($B$22=constants!$B$60,AND(I310>$B$12,$B$12<>-1)),O309+(N310-O309)*$O$74,O309+(L310-O309)*$O$74)","v":2.6515222222222228},2.6315222222222228,2.2000000000000002,2.2000000000000002,0,0,0,0,0,0,0,0,0]
[1,2.3499999999999939,2.6718000000000011,2.6868000000000012,2.6499000000000006,2.6649000000000007,2.1504999999999996,2.1654999999999998,{"$f":"IF($B$7=constants!$C$60,G311,IF($B$8=constants!$C$60,C311,E311))","v":2.6499000000000006},{"$f":"IF($B$7=constants!$C$60,H311,IF($B$8=constants!$C$60,D311,F311))","v":2.6649000000000007},1,2.6499000000000006,2.6,2.6,{"$f":"IF(OR($B$22=constants!$B$60,AND(I311>$B$12,$B$12<>-1)),O310+(N311-O310)*$O$74,O310+(L311-O310)*$O$74)","v":2.650062222222223},2.630062222222223,2.2000000000000002,2.2000000000000002,0,0,0,0,0,0,0,0,0]
[1,2.3599999999999937,2.668880000000001,2.6838800000000012,2.6484400000000008,2.6634400000000009,2.1494999999999993,2.1644999999999994,{"$f":"IF($B$7=constants!$C$60,G312,IF($B$8=constants!$C$60,C312,E312))","v":2.6484400000000008},{"$f":"IF($B$7=constants!$C$60,H312,IF($B$8=constants!$C$60,D312,F312))","v":2.6634400000000009},1,2.6484400000000008,2.6,2.6,{"$f":"IF(OR($B$22=constants!$B$60,AND(I312>$B$12,$B$12<>-1)),O311+(N312-O311)*$O$74,O311+(L312-O311)*$O$74)","v":2.6486022222222232},2.6286022222222232,2.2000000000000002,2.2000000000000002,0,0,0,0,0,0,0,0,0]
[1,2.3699999999999934,2.665960000000001,2.6809600000000011,2.6469800000000006,2.6619800000000007,2.1484999999999994,2.1634999999999995,{"$f":"IF($B$7=constants!$C$60,G313,IF($B$8=constants!$C$60,C313,E313))","v":2.6469800000000006},{"$f":"IF($B$7=constants!$C$60,H313,IF($B$8=constants!$C$60,D313,F313))","v":2.6619800000000007},1,2.6469800000000006,2.6,2.6,{"$f":"IF(OR($B$22=constants!$B$60,AND(I313>$B$12,$B$12<>-1)),O312+(N313-O312)*$O$74,O312+(L313-O312)*$O$74)","v":2.647142222222223},2.6271422222222229,2.2000000000000002,2.2000000000000002,0,0,0,0,0,0,0,0,0]
[1,2.3799999999999932,2.6630400000000014,2.6780400000000015,2.6455200000000008,2.6605200000000009,2.1474999999999995,2.1624999999999996,{"$f":"IF($B$7=constants!$C$60,G314,IF($B$8=constants!$C$60,C314,E314))","v":2.6455200000000008},{"$f":"IF($B$7=constants!$C$60,H314,IF($B$8=constants!$C$60,D314,F314))","v":2.6605200000000009},1,2.6455200000000008,2.6,2.6,{"$f":"IF(OR($B$22=constants!$B$60,AND(I314>$B$12,$B$12<>-1)),O313+(N314-O313)*$O$74,O313+(L314-O313)*$O$74)","v":2.6456822222222232},2.6256822222222231,2.2000000000000002,2.2000000000000002,0,0,0,0,0,0,0,0,0]
[1,2.389999999999993,2.6601200000000014,2.6751200000000015,2.6440600000000005,2.6590600000000006,2.1464999999999996,2.1614999999999998,{"$f":"IF($B$7=constants!$C$60,G315,IF($B$8=constants!$C$60,C315,E315))","v":2.6440600000000005},{"$f":"IF($B$7=constants!$C$60,H315,IF($B$8=constants!$C$60,D315,F315))","v":2.6590600000000006},1,2.6440600000000005,2.6,2.6,{"$f":"IF(OR($B$22=constants!$B$60,AND(I315>$B$12,$B$12<>-1)),O314+(N315-O314)*$O$74,O314+(L315-O314)*$O$74)","v":2.6442222222222229},2.6242222222222229,2.2000000000000002,2.2000000000000002,0,0,0,0,0,0,0,0,0]
[1,2.3999999999999928,2.6572000000000013,2.6722000000000015,2.6426000000000007,2.6576000000000009,2.1454999999999997,2.1604999999999999,{"$f":"IF($B$7=constants!$C$60,G316,IF($B$8=constants!$C$60,C316,E316))","v":2.6426000000000007},{"$f":"IF($B$7=constants!$C$60,H316,IF($B$8=constants!$C$60,D316,F316))","v":2.6576000000000009},1,2.6426000000000007,2.6,2.6,{"$f":"IF(OR($B$22=constants!$B$60,AND(I316>$B$12,$B$12<>-1)),O315+(N316-O315)*$O$74,O315+(L316-O315)*$O$74)","v":2.6427622222222231},2.6227622222222231,2.2000000000000002,2.2000000000000002,0,0,0,0,0,0,0,0,0]
[1,2.4099999999999926,2.6542800000000013,2.6692800000000014,2.6411400000000009,2.6561400000000011,2.1444999999999994,2.1594999999999995,{"$f":"IF($B$7=constants!$C$60,G317,IF($B$8=constants!$C$60,C317,E317))","v":2.6411400000000009},{"$f":"IF($B$7=constants!$C$60,H317,IF($B$8=constants!$C$60,D317,F317))","v":2.6561400000000011},1,2.6411400000000009,2.6,2.6,{"$f":"IF(OR($B$22=constants!$B$60,AND(I317>$B$12,$B$12<>-1)),O316+(N317-O316)*$O$74,O316+(L317-O316)*$O$74)","v":2.6413022222222233},2.6213022222222233,2.2000000000000002,2.2000000000000002,0,0,0,0,0,0,0,0,0]
[1,2.4199999999999924,2.6513600000000013,2.6663600000000014,2.6396800000000007,2.6546800000000008,2.1434999999999995,2.1584999999999996,{"$f":"IF($B$7=constants!$C$60,G318,IF($B$8=constants!$C$60,C318,E318))","v":2.6396800000000007},{"$f":"IF($B$7=constants!$C$60,H318,IF($B$8=constants!$C$60,D318,F318))","v":2.6546800000000008},1,2.6396800000000007,2.6,2.6,{"$f":"IF(OR($B$22=constants!$B$60,AND(I318>$B$12,$B$12<>-1)),O317+(N318-O317)*$O$74,O317+(L318-O317)*$O$74)","v":2.6398422222222231},2.6198422222222231,2.2000000000000002,2.2000000000000002,0,0,0,0,0,0,0,0,0]
[1,2.4299999999999922,2.6484400000000017,2.6634400000000018,2.6382200000000009,2.653220000000001,2.1424999999999996,2.1574999999999998,{"$f":"IF($B$7=constants!$C$60,G319,IF($B$8=constants!$C$60,C319,E319))","v":2.6382200000000009},{"$f":"IF($B$7=constants!$C$60,H319,IF($B$8=constants!$C$60,D319,F319))","v":2.653220000000001},1,2.6382200000000009,2.6,2.6,{"$f":"IF(OR($B$22=constants!$B$60,AND(I319>$B$12,$B$12<>-1)),O318+(N319-O318)*$O$74,O318+(L319-O318)*$O$74)","v":2.6383822222222233},2.6183822222222233,2.2000000000000002,2.2000000000000002,0,0,0,0,0,0,0,0,0]
[1,2.439999999999992,2.6455200000000016,2.6605200000000018,2.6367600000000007,2.6517600000000008,2.1414999999999997,2.1564999999999999,{"$f":"IF($B$7=constants!$C$60,G320,IF($B$8=constants!$C$60,C320,E320))","v":2.6367600000000007},{"$f":"IF($B$7=constants!$C$60,H320,IF($B$8=constants!$C$60,D320,F320))","v":2.6517600000000008},1,2.6367600000000007,2.6,2.6,{"$f":"IF(OR($B$22=constants!$B$60,AND(I320>$B$12,$B$12<>-1)),O319+(N320-O319)*$O$74,O319+(L320-O319)*$O$74)","v":2.6369222222222231},2.616922222222223,2.2000000000000002,2.2000000000000002,0,0,0,0,0,0,0,0,0]
[1,2.4499999999999917,2.6426000000000016,2.6576000000000017,2.6353000000000009,2.650300000000001,2.1404999999999998,2.1555,{"$f":"IF($B$7=constants!$C$60,G321,IF($B$8=constants!$C$60,C321,E321))","v":2.6353000000000009},{"$f":"IF($B$7=constants!$C$60,H321,IF($B$8=constants!$C$60,D321,F321))","v":2.650300000000001},1,2.6353000000000009,2.6,2.6,{"$f":"IF(OR($B$22=constants!$B$60,AND(I321>$B$12,$B$12<>-1)),O320+(N321-O320)*$O$74,O320+(L321-O320)*$O$74)","v":2.6354622222222233},2.6154622222222232,2.2000000000000002,2.2000000000000002,0,0,0,0,0,0,0,0,0]
[1,2.4599999999999915,2.6396800000000016,2.6546800000000017,2.6338400000000011,2.6488400000000012,2.1394999999999995,2.1544999999999996,{"$f":"IF($B$7=constants!$C$60,G322,IF($B$8=constants!$C$60,C322,E322))","v":2.6338400000000011},{"$f":"IF($B$7=constants!$C$60,H322,IF($B$8=constants!$C$60,D322,F322))","v":2.6488400000000012},1,2.6338400000000011,2.6,{"$f":"IF(M322>I322,L322,M322)","v":2.6},{"$f":"IF(OR($B$22=constants!$B$60,AND(I322>$B$12,$B$12<>-1)),O321+(N322-O321)*$O$74,O321+(L322-O321)*$O$74)","v":2.6340022222222235},2.6140022222222234,2.2000000000000002,2.2000000000000002,0,0,0,0,0,0,0,0,0]
[1,2.4699999999999913,2.6367600000000015,2.6517600000000017,2.6323800000000008,2.647380000000001,2.1384999999999996,2.1534999999999997,{"$f":"IF($B$7=constants!$C$60,G323,IF($B$8=constants!$C$60,C323,E323))","v":2.6323800000000008},{"$f":"IF($B$7=constants!$C$60,H323,IF($B$8=constants!$C$60,D323,F323))","v":2.647380000000001},1,2.6323800000000008,2.6,2.6,{"$f":"IF(OR($B$22=constants!$B$60,AND(I323>$B$12,$B$12<>-1)),O322+(N323-O322)*$O$74,O322+(L323-O322)*$O$74)","v":2.6325422222222232},2.6125422222222232,2.2000000000000002,2.2000000000000002,0,0,0,0,0,0,0,0,0]
[1,2.4799999999999911,2.633840000000002,2.6488400000000021,2.630920000000001,2.6459200000000012,2.1374999999999997,2.1524999999999999,{"$f":"IF($B$7=constants!$C$60,G324,IF($B$8=constants!$C$60,C324,E324))","v":2.630920000000001},{"$f":"IF($B$7=constants!$C$60,H324,IF($B$8=constants!$C$60,D324,F324))","v":2.6459200000000012},1,2.630920000000001,2.6,2.6,{"$f":"IF(OR($B$22=constants!$B$60,AND(I324>$B$12,$B$12<>-1)),O323+(N324-O323)*$O$74,O323+(L324-O323)*$O$74)","v":2.6310822222222234},2.6110822222222234,2.2000000000000002,2.2000000000000002,0,0,0,0,0,0,0,0,0]
[1,2.4899999999999909,2.6309200000000019,2.645920000000002,2.6294600000000008,2.6444600000000009,2.1364999999999998,2.1515,{"$f":"IF($B$7=constants!$C$60,G325,IF($B$8=constants!$C$60,C325,E325))","v":2.6294600000000008},{"$f":"IF($B$7=constants!$C$60,H325,IF($B$8=constants!$C$60,D325,F325))","v":2.6444600000000009},1,2.6294600000000008,2.6,2.6,{"$f":"IF(OR($B$22=constants!$B$60,AND(I325>$B$12,$B$12<>-1)),O324+(N325-O324)*$O$74,O324+(L325-O324)*$O$74)","v":2.6296222222222232},2.6096222222222232,2.2000000000000002,2.2000000000000002,0,0,0,0,0,0,0,0,0]
[1,2.4999999999999907,{"$f":"$D$41*B326+$D$42","v":2.6279999999999966},2.6429999999999967,{"$f":"$K$19*$B326+$K$20","v":2.6279999999999983},2.6429999999999985,2.1355,2.1505000000000001,{"$f":"IF($B$7=constants!$C$60,G326,IF($B$8=constants!$C$60,C326,E326))","v":2.6279999999999983},{"$f":"IF($B$7=constants!$C$60,H326,IF($B$8=constants!$C$60,D326,F326))","v":2.6429999999999985},1,2.6279999999999983,2.6,2.6,{"$f":"IF(OR($B$22=constants!$B$60,AND(I326>$B$12,$B$12<>-1)),O325+(N326-O325)*$O$74,O325+(L326-O325)*$O$74)","v":2.6281622222222207},2.6081622222222207,2.2000000000000002,2.2000000000000002,0,0,0,0,0,0,0,0,0]
[1,2.5099999999999905,{"$f":"$D$41*B327+$D$42","v":2.6309199999999966},2.6459199999999967,{"$f":"$K$19*$B327+$K$20","v":2.6294599999999981},2.6444599999999983,2.1344999999999996,2.1494999999999997,{"$f":"IF($B$7=constants!$C$60,G327,IF($B$8=constants!$C$60,C327,E327))","v":2.6294599999999981},{"$f":"IF($B$7=constants!$C$60,H327,IF($B$8=constants!$C$60,D327,F327))","v":2.6444599999999983},1,2.6294599999999981,2.6,2.6,{"$f":"IF(OR($B$22=constants!$B$60,AND(I327>$B$12,$B$12<>-1)),O326+(N327-O326)*$O$74,O326+(L327-O326)*$O$74)","v":2.6293302222222206},2.6093302222222206,2.2000000000000002,2.2000000000000002,0,0,0,0,0,0,0,0,0]
[1,2.5199999999999902,2.6338399999999966,2.6488399999999968,2.6309199999999984,2.6459199999999985,2.1334999999999997,2.1484999999999999,{"$f":"IF($B$7=constants!$C$60,G328,IF($B$8=constants!$C$60,C328,E328))","v":2.6309199999999984},{"$f":"IF($B$7=constants!$C$60,H328,IF($B$8=constants!$C$60,D328,F328))","v":2.6459199999999985},1,2.6309199999999984,2.6,2.6,{"$f":"IF(OR($B$22=constants!$B$60,AND(I328>$B$12,$B$12<>-1)),O327+(N328-O327)*$O$74,O327+(L328-O327)*$O$74)","v":2.6307610222222206},2.6107610222222206,2.2000000000000002,2.2000000000000002,0,0,0,0,0,0,0,0,0]
[1,2.52999999999999,2.6367599999999967,2.6517599999999968,2.6323799999999982,2.6473799999999983,2.1324999999999998,2.1475,{"$f":"IF($B$7=constants!$C$60,G329,IF($B$8=constants!$C$60,C329,E329))","v":2.6323799999999982},{"$f":"IF($B$7=constants!$C$60,H329,IF($B$8=constants!$C$60,D329,F329))","v":2.6473799999999983},1,2.6323799999999982,2.6,2.6,{"$f":"IF(OR($B$22=constants!$B$60,AND(I329>$B$12,$B$12<>-1)),O328+(N329-O328)*$O$74,O328+(L329-O328)*$O$74)","v":2.6322181022222204},2.6122181022222204,2.2000000000000002,2.2000000000000002,0,0,0,0,0,0,0,0,0]
[1,2.5399999999999898,2.6396799999999967,2.6546799999999968,2.6338399999999984,2.6488399999999985,2.1315,2.1465000000000001,{"$f":"IF($B$7=constants!$C$60,G330,IF($B$8=constants!$C$60,C330,E330))","v":2.6338399999999984},{"$f":"IF($B$7=constants!$C$60,H330,IF($B$8=constants!$C$60,D330,F330))","v":2.6488399999999985},1,2.6338399999999984,2.6,2.6,{"$f":"IF(OR($B$22=constants!$B$60,AND(I330>$B$12,$B$12<>-1)),O329+(N330-O329)*$O$74,O329+(L330-O329)*$O$74)","v":2.6336778102222205},2.6136778102222205,2.2000000000000002,2.2000000000000002,0,0,0,0,0,0,0,0,0]
[1,2.5499999999999896,2.6425999999999963,2.6575999999999964,2.6352999999999982,2.6502999999999983,2.1305000000000001,2.1455000000000002,{"$f":"IF($B$7=constants!$C$60,G331,IF($B$8=constants!$C$60,C331,E331))","v":2.6352999999999982},{"$f":"IF($B$7=constants!$C$60,H331,IF($B$8=constants!$C$60,D331,F331))","v":2.6502999999999983},1,2.6352999999999982,2.6,2.6,{"$f":"IF(OR($B$22=constants!$B$60,AND(I331>$B$12,$B$12<>-1)),O330+(N331-O330)*$O$74,O330+(L331-O330)*$O$74)","v":2.6351377810222205},2.6151377810222205,2.2000000000000002,2.2000000000000002,0,0,0,0,0,0,0,0,0]
[1,2.5599999999999894,2.6455199999999963,2.6605199999999964,2.636759999999998,2.6517599999999981,2.1294999999999997,2.1444999999999999,{"$f":"IF($B$7=constants!$C$60,G332,IF($B$8=constants!$C$60,C332,E332))","v":2.636759999999998},{"$f":"IF($B$7=constants!$C$60,H332,IF($B$8=constants!$C$60,D332,F332))","v":2.6517599999999981},1,2.636759999999998,2.6,2.6,{"$f":"IF(OR($B$22=constants!$B$60,AND(I332>$B$12,$B$12<>-1)),O331+(N332-O331)*$O$74,O331+(L332-O331)*$O$74)","v":2.6365977781022201},2.6165977781022201,2.2000000000000002,2.2000000000000002,0,0,0,0,0,0,0,0,0]
[{"$f":"IF(B333<=100,1,IF(B333<=200,2,3))","v":1},2.5699999999999892,2.6484399999999964,2.6634399999999965,2.6382199999999982,2.6532199999999984,2.1284999999999998,2.1435,{"$f":"IF($B$7=constants!$C$60,G333,IF($B$8=constants!$C$60,C333,E333))","v":2.6382199999999982},{"$f":"IF($B$7=constants!$C$60,H333,IF($B$8=constants!$C$60,D333,F333))","v":2.6532199999999984},1,2.6382199999999982,2.6,2.6,{"$f":"IF(OR($B$22=constants!$B$60,AND(I333>$B$12,$B$12<>-1)),O332+(N333-O332)*$O$74,O332+(L333-O332)*$O$74)","v":2.6380577778102205},{"$f":"IF(O333=0,0,O333-$P$72)","v":2.6180577778102205},2.2000000000000002,2.2000000000000002,{"$f":"S$72*IF(S$71=0,$L333,IF(S$71=1,$R333,IF($B$12=-1,$L333,IF($I333>$B$12,$R333,$L333))))","v":0},0,0,0,0,0,{"$f":"IF(V333=0,0,V333-Y$72)","v":0},{"$f":"IF(W333=0,0,W333-Z$72)","v":0},{"$f":"IF(X333=0,0,X333-AA$72)","v":0}]
[1,{"$f":"B333+0.01","v":2.579999999999989},2.6513599999999959,2.6663599999999961,2.639679999999998,2.6546799999999982,2.1274999999999999,2.1425000000000001,{"$f":"IF($B$7=constants!$C$60,G334,IF($B$8=constants!$C$60,C334,E334))","v":2.639679999999998},{"$f":"IF($B$7=constants!$C$60,H334,IF($B$8=constants!$C$60,D334,F334))","v":2.6546799999999982},{"$f":"IF(AND(I334>$B$16,K333=0),1,IF(AND(I334<$B$17,K333=1),0,K333))","v":1},2.639679999999998,2.6,2.6,{"$f":"IF(OR($B$22=constants!$B$60,AND(I334>$B$12,$B$12<>-1)),O333+(N334-O333)*$O$74,O333+(L334-O333)*$O$74)","v":2.6395177777810201},2.6195177777810201,2.2000000000000002,{"$f":"IF(Q334>I334,I334,Q334)","v":2.2000000000000002},0,0,0,{"$f":"V333+(S334-V$72-V333)*V$74","v":0},{"$f":"W333+(T334-W$72-W333)*W$74","v":0},{"$f":"X333+(U334-X$72-X333)*X$74","v":0},0,0,0]
[1,2.5899999999999888,2.6542799999999964,2.6692799999999965,2.6411399999999983,2.6561399999999984,2.1265000000000001,2.1415000000000002,{"$f":"IF($B$7=constants!$C$60,G335,IF($B$8=constants!$C$60,C335,E335))","v":2.6411399999999983},{"$f":"IF($B$7=constants!$C$60,H335,IF($B$8=constants!$C$60,D335,F335))","v":2.6561399999999984},1,2.6411399999999983,2.6,2.6,{"$f":"IF(OR($B$22=constants!$B$60,AND(I335>$B$12,$B$12<>-1)),O334+(N335-O334)*$O$74,O334+(L335-O334)*$O$74)","v":2.6409777777781005},2.6209777777781005,2.2000000000000002,2.2000000000000002,0,0,0,0,0,0,0,0,0]
[1,2.5999999999999885,2.657199999999996,2.6721999999999961,2.6425999999999981,2.6575999999999982,2.1255000000000002,2.1405000000000003,{"$f":"IF($B$7=constants!$C$60,G336,IF($B$8=constants!$C$60,C336,E336))","v":2.6425999999999981},{"$f":"IF($B$7=constants!$C$60,H336,IF($B$8=constants!$C$60,D336,F336))","v":2.6575999999999982},1,2.6425999999999981,2.6,2.6,{"$f":"IF(OR($B$22=constants!$B$60,AND(I336>$B$12,$B$12<>-1)),O335+(N336-O335)*$O$74,O335+(L336-O335)*$O$74)","v":2.6424377777778085},2.6224377777778085,2.2000000000000002,2.2000000000000002,0,0,0,0,0,0,0,0,0]
[1,2.6099999999999883,2.660119999999996,2.6751199999999962,2.6440599999999979,{"$f":"E337+$F$74","v":2.659059999999998},2.1244999999999998,2.1395,{"$f":"IF($B$7=constants!$C$60,G337,IF($B$8=constants!$C$60,C337,E337))","v":2.6440599999999979},{"$f":"IF($B$7=constants!$C$60,H337,IF($B$8=constants!$C$60,D337,F337))","v":2.659059999999998},1,2.6440599999999979,2.6,2.6,{"$f":"IF(OR($B$22=constants!$B$60,AND(I337>$B$12,$B$12<>-1)),O336+(N337-O336)*$O$74,O336+(L337-O336)*$O$74)","v":2.643897777777779},2.623897777777779,2.2000000000000002,2.2000000000000002,0,0,0,0,0,0,0,0,0]
[1,2.6199999999999881,2.6630399999999961,2.6780399999999962,2.6455199999999981,2.6605199999999982,2.1234999999999999,2.1385000000000001,{"$f":"IF($B$7=constants!$C$60,G338,IF($B$8=constants!$C$60,C338,E338))","v":2.6455199999999981},{"$f":"IF($B$7=constants!$C$60,H338,IF($B$8=constants!$C$60,D338,F338))","v":2.6605199999999982},1,2.6455199999999981,2.6,2.6,{"$f":"IF(OR($B$22=constants!$B$60,AND(I338>$B$12,$B$12<>-1)),O337+(N338-O337)*$O$74,O337+(L338-O337)*$O$74)","v":2.6453577777777761},2.6253577777777761,2.2000000000000002,2.2000000000000002,0,0,0,0,0,0,0,0,0]
[1,2.6299999999999879,2.6659599999999957,2.6809599999999958,2.6469799999999979,2.661979999999998,2.1225000000000001,2.1375000000000002,{"$f":"IF($B$7=constants!$C$60,G339,IF($B$8=constants!$C$60,C339,E339))","v":2.6469799999999979},{"$f":"IF($B$7=constants!$C$60,H339,IF($B$8=constants!$C$60,D339,F339))","v":2.661979999999998},1,2.6469799999999979,2.6,2.6,{"$f":"IF(OR($B$22=constants!$B$60,AND(I339>$B$12,$B$12<>-1)),O338+(N339-O338)*$O$74,O338+(L339-O338)*$O$74)","v":2.6468177777777759},2.6268177777777759,2.2000000000000002,2.2000000000000002,0,0,0,0,0,0,0,0,0]
[1,2.6399999999999877,2.6688799999999957,2.6838799999999958,2.6484399999999977,2.6634399999999978,2.1215000000000002,{"$f":"$H$63*B340+$H$64","v":2.1365000000000003},{"$f":"IF($B$7=constants!$C$60,G340,IF($B$8=constants!$C$60,C340,E340))","v":2.6484399999999977},{"$f":"IF($B$7=constants!$C$60,H340,IF($B$8=constants!$C$60,D340,F340))","v":2.6634399999999978},1,2.6484399999999977,2.6,2.6,{"$f":"IF(OR($B$22=constants!$B$60,AND(I340>$B$12,$B$12<>-1)),O339+(N340-O339)*$O$74,O339+(L340-O339)*$O$74)","v":2.6482777777777757},2.6282777777777757,2.2000000000000002,2.2000000000000002,0,0,0,0,0,0,0,0,0]
[1,2.6499999999999875,2.6717999999999957,{"$f":"C341+$D$74","v":2.6867999999999959},2.6498999999999979,2.664899999999998,2.1205000000000003,2.1355000000000004,{"$f":"IF($B$7=constants!$C$60,G341,IF($B$8=constants!$C$60,C341,E341))","v":2.6498999999999979},{"$f":"IF($B$7=constants!$C$60,H341,IF($B$8=constants!$C$60,D341,F341))","v":2.664899999999998},1,2.6498999999999979,2.6,2.6,{"$f":"IF(OR($B$22=constants!$B$60,AND(I341>$B$12,$B$12<>-1)),O340+(N341-O340)*$O$74,O340+(L341-O340)*$O$74)","v":2.6497377777777755},2.6297377777777755,2.2000000000000002,2.2000000000000002,0,0,0,0,0,0,0,0,0]
[1,2.6599999999999873,2.6747199999999958,2.6897199999999959,2.6513599999999977,2.6663599999999978,{"$f":"(H342-$H$74)/(1-EXP(-1/G$74))*(1-EXP(-$B342/G$74))","v":2.1194999999999999},2.1345000000000001,{"$f":"IF($B$7=constants!$C$60,G342,IF($B$8=constants!$C$60,C342,E342))","v":2.6513599999999977},{"$f":"IF($B$7=constants!$C$60,H342,IF($B$8=constants!$C$60,D342,F342))","v":2.6663599999999978},1,2.6513599999999977,2.6,2.6,{"$f":"IF(OR($B$22=constants!$B$60,AND(I342>$B$12,$B$12<>-1)),O341+(N342-O341)*$O$74,O341+(L342-O341)*$O$74)","v":2.6511977777777753},2.6311977777777753,2.2000000000000002,2.2000000000000002,0,0,0,0,0,0,0,0,0]
[1,2.6699999999999871,2.6776399999999958,2.6926399999999959,2.652819999999998,2.6678199999999981,2.1185,2.1335000000000002,{"$f":"IF($B$7=constants!$C$60,G343,IF($B$8=constants!$C$60,C343,E343))","v":2.652819999999998},{"$f":"IF($B$7=constants!$C$60,H343,IF($B$8=constants!$C$60,D343,F343))","v":2.6678199999999981},1,2.652819999999998,2.6,2.6,{"$f":"IF(OR($B$22=constants!$B$60,AND(I343>$B$12,$B$12<>-1)),O342+(N343-O342)*$O$74,O342+(L343-O342)*$O$74)","v":2.6526577777777756},2.6326577777777755,2.2000000000000002,2.2000000000000002,0,0,0,0,0,0,0,0,0]
[1,2.6799999999999868,2.6805599999999954,2.6955599999999955,2.6542799999999978,2.6692799999999979,2.1175000000000002,2.1325000000000003,{"$f":"IF($B$7=constants!$C$60,G344,IF($B$8=constants!$C$60,C344,E344))","v":2.6542799999999978},{"$f":"IF($B$7=constants!$C$60,H344,IF($B$8=constants!$C$60,D344,F344))","v":2.6692799999999979},1,2.6542799999999978,2.6,2.6,{"$f":"IF(OR($B$22=constants!$B$60,AND(I344>$B$12,$B$12<>-1)),O343+(N344-O343)*$O$74,O343+(L344-O343)*$O$74)","v":2.6541177777777754},2.6341177777777753,2.2000000000000002,2.2000000000000002,0,0,0,0,0,0,0,0,0]
[1,2.6899999999999866,2.6834799999999954,2.6984799999999955,2.6557399999999975,2.6707399999999977,2.1165000000000003,2.1315000000000004,{"$f":"IF($B$7=constants!$C$60,G345,IF($B$8=constants!$C$60,C345,E345))","v":2.6557399999999975},{"$f":"IF($B$7=constants!$C$60,H345,IF($B$8=constants!$C$60,D345,F345))","v":2.6707399999999977},1,2.6557399999999975,2.6,2.6,{"$f":"IF(OR($B$22=constants!$B$60,AND(I345>$B$12,$B$12<>-1)),O344+(N345-O344)*$O$74,O344+(L345-O344)*$O$74)","v":2.6555777777777752},2.6355777777777751,2.2000000000000002,2.2000000000000002,0,0,0,0,0,0,0,0,0]
[1,2.6999999999999864,2.6863999999999955,2.7013999999999956,2.6571999999999978,2.6721999999999979,2.1155000000000004,2.1305000000000005,{"$f":"IF($B$7=constants!$C$60,G346,IF($B$8=constants!$C$60,C346,E346))","v":2.6571999999999978},{"$f":"IF($B$7=constants!$C$60,H346,IF($B$8=constants!$C$60,D346,F346))","v":2.6721999999999979},1,2.6571999999999978,2.6,2.6,{"$f":"IF(OR($B$22=constants!$B$60,AND(I346>$B$12,$B$12<>-1)),O345+(N346-O345)*$O$74,O345+(L346-O345)*$O$74)","v":2.6570377777777754},2.6370377777777754,2.2000000000000002,2.2000000000000002,0,0,0,0,0,0,0,0,0]
[1,2.7099999999999862,2.6893199999999955,2.7043199999999956,2.6586599999999976,2.6736599999999977,2.1145,2.1295000000000002,{"$f":"IF($B$7=constants!$C$60,G347,IF($B$8=constants!$C$60,C347,E347))","v":2.6586599999999976},{"$f":"IF($B$7=constants!$C$60,H347,IF($B$8=constants!$C$60,D347,F347))","v":2.6736599999999977},1,2.6586599999999976,2.6,2.6,{"$f":"IF(OR($B$22=constants!$B$60,AND(I347>$B$12,$B$12<>-1)),O346+(N347-O346)*$O$74,O346+(L347-O346)*$O$74)","v":2.6584977777777752},2.6384977777777752,2.2000000000000002,2.2000000000000002,0,0,0,0,0,0,0,0,0]
[1,2.719999999999986,2.6922399999999955,2.7072399999999956,2.6601199999999974,2.6751199999999975,2.1135000000000002,2.1285000000000003,{"$f":"IF($B$7=constants!$C$60,G348,IF($B$8=constants!$C$60,C348,E348))","v":2.6601199999999974},{"$f":"IF($B$7=constants!$C$60,H348,IF($B$8=constants!$C$60,D348,F348))","v":2.6751199999999975},1,2.6601199999999974,2.6,2.6,{"$f":"IF(OR($B$22=constants!$B$60,AND(I348>$B$12,$B$12<>-1)),O347+(N348-O347)*$O$74,O347+(L348-O347)*$O$74)","v":2.659957777777775},2.639957777777775,2.2000000000000002,2.2000000000000002,0,0,0,0,0,0,0,0,0]
[1,2.7299999999999858,2.6951599999999951,2.7101599999999952,2.6615799999999976,2.6765799999999977,2.1125000000000003,2.1275000000000004,{"$f":"IF($B$7=constants!$C$60,G349,IF($B$8=constants!$C$60,C349,E349))","v":2.6615799999999976},{"$f":"IF($B$7=constants!$C$60,H349,IF($B$8=constants!$C$60,D349,F349))","v":2.6765799999999977},1,2.6615799999999976,2.6,2.6,{"$f":"IF(OR($B$22=constants!$B$60,AND(I349>$B$12,$B$12<>-1)),O348+(N349-O348)*$O$74,O348+(L349-O348)*$O$74)","v":2.6614177777777752},2.6414177777777752,2.2000000000000002,2.2000000000000002,0,0,0,0,0,0,0,0,0]
[1,2.7399999999999856,2.6980799999999951,2.7130799999999953,2.6630399999999974,2.6780399999999975,2.1115000000000004,2.1265000000000005,{"$f":"IF($B$7=constants!$C$60,G350,IF($B$8=constants!$C$60,C350,E350))","v":2.6630399999999974},{"$f":"IF($B$7=constants!$C$60,H350,IF($B$8=constants!$C$60,D350,F350))","v":2.6780399999999975},1,2.6630399999999974,2.6,2.6,{"$f":"IF(OR($B$22=constants!$B$60,AND(I350>$B$12,$B$12<>-1)),O349+(N350-O349)*$O$74,O349+(L350-O349)*$O$74)","v":2.662877777777775},2.642877777777775,2.2000000000000002,2.2000000000000002,0,0,0,0,0,0,0,0,0]
[1,2.7499999999999853,{"$f":"$D$45*B351+$D$46","v":2.7010000000000036},2.7160000000000037,2.6644999999999976,2.6794999999999978,2.1105000000000005,2.1255000000000006,{"$f":"IF($B$7=constants!$C$60,G351,IF($B$8=constants!$C$60,C351,E351))","v":2.6644999999999976},{"$f":"IF($B$7=constants!$C$60,H351,IF($B$8=constants!$C$60,D351,F351))","v":2.6794999999999978},1,2.6644999999999976,2.6,2.6,{"$f":"IF(OR($B$22=constants!$B$60,AND(I351>$B$12,$B$12<>-1)),O350+(N351-O350)*$O$74,O350+(L351-O350)*$O$74)","v":2.6643377777777753},2.6443377777777752,2.2000000000000002,2.2000000000000002,0,0,0,0,0,0,0,0,0]
[1,2.7599999999999851,{"$f":"$D$45*B352+$D$46","v":2.6980800000000036},2.7130800000000037,2.6659599999999974,2.6809599999999976,2.1095000000000002,2.1245000000000003,{"$f":"IF($B$7=constants!$C$60,G352,IF($B$8=constants!$C$60,C352,E352))","v":2.6659599999999974},{"$f":"IF($B$7=constants!$C$60,H352,IF($B$8=constants!$C$60,D352,F352))","v":2.6809599999999976},1,2.6659599999999974,2.6,2.6,{"$f":"IF(OR($B$22=constants!$B$60,AND(I352>$B$12,$B$12<>-1)),O351+(N352-O351)*$O$74,O351+(L352-O351)*$O$74)","v":2.665797777777775},2.645797777777775,2.2000000000000002,2.2000000000000002,0,0,0,0,0,0,0,0,0]
[1,2.7699999999999849,2.6951600000000036,2.7101600000000037,2.6674199999999972,2.6824199999999974,2.1085000000000003,2.1235000000000004,{"$f":"IF($B$7=constants!$C$60,G353,IF($B$8=constants!$C$60,C353,E353))","v":2.6674199999999972},{"$f":"IF($B$7=constants!$C$60,H353,IF($B$8=constants!$C$60,D353,F353))","v":2.6824199999999974},1,2.6674199999999972,2.6,2.6,{"$f":"IF(OR($B$22=constants!$B$60,AND(I353>$B$12,$B$12<>-1)),O352+(N353-O352)*$O$74,O352+(L353-O352)*$O$74)","v":2.6672577777777748},2.6472577777777748,2.2000000000000002,2.2000000000000002,0,0,0,0,0,0,0,0,0]
[1,2.7799999999999847,2.6922400000000035,2.7072400000000036,2.6688799999999975,2.6838799999999976,2.1075000000000004,2.1225000000000005,{"$f":"IF($B$7=constants!$C$60,G354,IF($B$8=constants!$C$60,C354,E354))","v":2.6688799999999975},{"$f":"IF($B$7=constants!$C$60,H354,IF($B$8=constants!$C$60,D354,F354))","v":2.6838799999999976},1,2.6688799999999975,2.6,2.6,{"$f":"IF(OR($B$22=constants!$B$60,AND(I354>$B$12,$B$12<>-1)),O353+(N354-O353)*$O$74,O353+(L354-O353)*$O$74)","v":2.6687177777777751},2.6487177777777751,2.2000000000000002,2.2000000000000002,0,0,0,0,0,0,0,0,0]
[1,2.7899999999999845,2.6893200000000039,2.7043200000000041,2.6703399999999973,2.6853399999999974,2.1065000000000005,2.1215000000000006,{"$f":"IF($B$7=constants!$C$60,G355,IF($B$8=constants!$C$60,C355,E355))","v":2.6703399999999973},{"$f":"IF($B$7=constants!$C$60,H355,IF($B$8=constants!$C$60,D355,F355))","v":2.6853399999999974},1,2.6703399999999973,2.6,2.6,{"$f":"IF(OR($B$22=constants!$B$60,AND(I355>$B$12,$B$12<>-1)),O354+(N355-O354)*$O$74,O354+(L355-O354)*$O$74)","v":2.6701777777777749},2.6501777777777749,2.2000000000000002,2.2000000000000002,0,0,0,0,0,0,0,0,0]
[1,2.7999999999999843,2.6864000000000039,2.701400000000004,2.6717999999999975,2.6867999999999976,2.1055000000000006,2.1205000000000007,{"$f":"IF($B$7=constants!$C$60,G356,IF($B$8=constants!$C$60,C356,E356))","v":2.6717999999999975},{"$f":"IF($B$7=constants!$C$60,H356,IF($B$8=constants!$C$60,D356,F356))","v":2.6867999999999976},1,2.6717999999999975,2.6,2.6,{"$f":"IF(OR($B$22=constants!$B$60,AND(I356>$B$12,$B$12<>-1)),O355+(N356-O355)*$O$74,O355+(L356-O355)*$O$74)","v":2.6716377777777751},2.6516377777777751,2.2000000000000002,2.2000000000000002,0,0,0,0,0,0,0,0,0]
[1,2.8099999999999841,2.6834800000000039,2.698480000000004,2.6732599999999973,2.6882599999999974,2.1045000000000003,2.1195000000000004,{"$f":"IF($B$7=constants!$C$60,G357,IF($B$8=constants!$C$60,C357,E357))","v":2.6732599999999973},{"$f":"IF($B$7=constants!$C$60,H357,IF($B$8=constants!$C$60,D357,F357))","v":2.6882599999999974},1,2.6732599999999973,2.6,2.6,{"$f":"IF(OR($B$22=constants!$B$60,AND(I357>$B$12,$B$12<>-1)),O356+(N357-O356)*$O$74,O356+(L357-O356)*$O$74)","v":2.6730977777777749},2.6530977777777749,2.2000000000000002,2.2000000000000002,0,0,0,0,0,0,0,0,0]
[1,2.8199999999999839,2.6805600000000038,2.695560000000004,2.6747199999999971,2.6897199999999972,2.1035000000000004,2.1185000000000005,{"$f":"IF($B$7=constants!$C$60,G358,IF($B$8=constants!$C$60,C358,E358))","v":2.6747199999999971},{"$f":"IF($B$7=constants!$C$60,H358,IF($B$8=constants!$C$60,D358,F358))","v":2.6897199999999972},1,2.6747199999999971,2.6,2.6,{"$f":"IF(OR($B$22=constants!$B$60,AND(I358>$B$12,$B$12<>-1)),O357+(N358-O357)*$O$74,O357+(L358-O357)*$O$74)","v":2.6745577777777747},2.6545577777777747,2.2000000000000002,2.2000000000000002,0,0,0,0,0,0,0,0,0]
[1,2.8299999999999836,2.6776400000000038,2.6926400000000039,2.6761799999999973,2.6911799999999975,2.1025000000000005,2.1175000000000006,{"$f":"IF($B$7=constants!$C$60,G359,IF($B$8=constants!$C$60,C359,E359))","v":2.6761799999999973},{"$f":"IF($B$7=constants!$C$60,H359,IF($B$8=constants!$C$60,D359,F359))","v":2.6911799999999975},1,2.6761799999999973,2.6,2.6,{"$f":"IF(OR($B$22=constants!$B$60,AND(I359>$B$12,$B$12<>-1)),O358+(N359-O358)*$O$74,O358+(L359-O358)*$O$74)","v":2.6760177777777749},2.6560177777777749,2.2000000000000002,2.2000000000000002,0,0,0,0,0,0,0,0,0]
[1,2.8399999999999834,2.6747200000000042,2.6897200000000043,2.6776399999999971,2.6926399999999973,2.1015000000000006,2.1165000000000007,{"$f":"IF($B$7=constants!$C$60,G360,IF($B$8=constants!$C$60,C360,E360))","v":2.6776399999999971},{"$f":"IF($B$7=constants!$C$60,H360,IF($B$8=constants!$C$60,D360,F360))","v":2.6926399999999973},1,2.6776399999999971,2.6,2.6,{"$f":"IF(OR($B$22=constants!$B$60,AND(I360>$B$12,$B$12<>-1)),O359+(N360-O359)*$O$74,O359+(L360-O359)*$O$74)","v":2.6774777777777747},2.6574777777777747,2.2000000000000002,2.2000000000000002,0,0,0,0,0,0,0,0,0]
[1,2.8499999999999832,2.6718000000000042,2.6868000000000043,2.6790999999999974,2.6940999999999975,2.1005000000000007,2.1155000000000008,{"$f":"IF($B$7=constants!$C$60,G361,IF($B$8=constants!$C$60,C361,E361))","v":2.6790999999999974},{"$f":"IF($B$7=constants!$C$60,H361,IF($B$8=constants!$C$60,D361,F361))","v":2.6940999999999975},1,2.6790999999999974,2.6,2.6,{"$f":"IF(OR($B$22=constants!$B$60,AND(I361>$B$12,$B$12<>-1)),O360+(N361-O360)*$O$74,O360+(L361-O360)*$O$74)","v":2.678937777777775},2.658937777777775,2.2000000000000002,2.2000000000000002,0,0,0,0,0,0,0,0,0]
[1,2.859999999999983,2.6688800000000041,2.6838800000000043,2.6805599999999972,2.6955599999999973,2.0995000000000004,2.1145000000000005,{"$f":"IF($B$7=constants!$C$60,G362,IF($B$8=constants!$C$60,C362,E362))","v":2.6805599999999972},{"$f":"IF($B$7=constants!$C$60,H362,IF($B$8=constants!$C$60,D362,F362))","v":2.6955599999999973},1,2.6805599999999972,2.6,2.6,{"$f":"IF(OR($B$22=constants!$B$60,AND(I362>$B$12,$B$12<>-1)),O361+(N362-O361)*$O$74,O361+(L362-O361)*$O$74)","v":2.6803977777777748},2.6603977777777748,2.2000000000000002,2.2000000000000002,0,0,0,0,0,0,0,0,0]
[1,2.8699999999999828,2.6659600000000041,2.6809600000000042,2.682019999999997,2.6970199999999971,2.0985000000000005,2.1135000000000006,{"$f":"IF($B$7=constants!$C$60,G363,IF($B$8=constants!$C$60,C363,E363))","v":2.682019999999997},{"$f":"IF($B$7=constants!$C$60,H363,IF($B$8=constants!$C$60,D363,F363))","v":2.6970199999999971},1,2.682019999999997,2.6,2.6,{"$f":"IF(OR($B$22=constants!$B$60,AND(I363>$B$12,$B$12<>-1)),O362+(N363-O362)*$O$74,O362+(L363-O362)*$O$74)","v":2.6818577777777746},2.6618577777777745,2.2000000000000002,2.2000000000000002,0,0,0,0,0,0,0,0,0]
[1,2.8799999999999826,2.6630400000000041,2.6780400000000042,2.6834799999999972,2.6984799999999973,2.0975000000000006,2.1125000000000007,{"$f":"IF($B$7=constants!$C$60,G364,IF($B$8=constants!$C$60,C364,E364))","v":2.6834799999999972},{"$f":"IF($B$7=constants!$C$60,H364,IF($B$8=constants!$C$60,D364,F364))","v":2.6984799999999973},1,2.6834799999999972,2.6,2.6,{"$f":"IF(OR($B$22=constants!$B$60,AND(I364>$B$12,$B$12<>-1)),O363+(N364-O363)*$O$74,O363+(L364-O363)*$O$74)","v":2.6833177777777748},2.6633177777777748,2.2000000000000002,2.2000000000000002,0,0,0,0,0,0,0,0,0]
[1,2.8899999999999824,2.6601200000000045,2.6751200000000046,2.684939999999997,2.6999399999999971,2.0965000000000007,2.1115000000000008,{"$f":"IF($B$7=constants!$C$60,G365,IF($B$8=constants!$C$60,C365,E365))","v":2.684939999999997},{"$f":"IF($B$7=constants!$C$60,H365,IF($B$8=constants!$C$60,D365,F365))","v":2.6999399999999971},1,2.684939999999997,2.6,2.6,{"$f":"IF(OR($B$22=constants!$B$60,AND(I365>$B$12,$B$12<>-1)),O364+(N365-O364)*$O$74,O364+(L365-O364)*$O$74)","v":2.6847777777777746},2.6647777777777746,2.2000000000000002,2.2000000000000002,0,0,0,0,0,0,0,0,0]
[1,2.8999999999999821,2.6572000000000044,2.6722000000000046,2.6863999999999972,2.7013999999999974,2.0955000000000008,2.1105000000000009,{"$f":"IF($B$7=constants!$C$60,G366,IF($B$8=constants!$C$60,C366,E366))","v":2.6863999999999972},{"$f":"IF($B$7=constants!$C$60,H366,IF($B$8=constants!$C$60,D366,F366))","v":2.7013999999999974},1,2.6863999999999972,2.6,2.6,{"$f":"IF(OR($B$22=constants!$B$60,AND(I366>$B$12,$B$12<>-1)),O365+(N366-O365)*$O$74,O365+(L366-O365)*$O$74)","v":2.6862377777777748},2.6662377777777748,2.2000000000000002,2.2000000000000002,0,0,0,0,0,0,0,0,0]
[1,2.9099999999999819,2.6542800000000044,2.6692800000000045,2.687859999999997,2.7028599999999972,2.0945000000000005,2.1095000000000006,{"$f":"IF($B$7=constants!$C$60,G367,IF($B$8=constants!$C$60,C367,E367))","v":2.687859999999997},{"$f":"IF($B$7=constants!$C$60,H367,IF($B$8=constants!$C$60,D367,F367))","v":2.7028599999999972},1,2.687859999999997,2.6,2.6,{"$f":"IF(OR($B$22=constants!$B$60,AND(I367>$B$12,$B$12<>-1)),O366+(N367-O366)*$O$74,O366+(L367-O366)*$O$74)","v":2.6876977777777746},2.6676977777777746,2.2000000000000002,2.2000000000000002,0,0,0,0,0,0,0,0,0]
[1,2.9199999999999817,2.6513600000000048,2.6663600000000049,2.6893199999999968,2.7043199999999969,2.0935000000000006,2.1085000000000007,{"$f":"IF($B$7=constants!$C$60,G368,IF($B$8=constants!$C$60,C368,E368))","v":2.6893199999999968},{"$f":"IF($B$7=constants!$C$60,H368,IF($B$8=constants!$C$60,D368,F368))","v":2.7043199999999969},1,{"$f":"IF($K368=0,IF($I368>$B$16,L367+($I368-L367)*L$74-J$72,L367-L367/L$74),IF($I368>$B$17,L367+($I368-L367)*L$74-J$72,L367-L367/L$74))","v":2.6893199999999968},2.6,2.6,{"$f":"IF(OR($B$22=constants!$B$60,AND(I368>$B$12,$B$12<>-1)),O367+(N368-O367)*$O$74,O367+(L368-O367)*$O$74)","v":2.6891577777777744},2.6691577777777744,{"$f":"IF($K368=0,IF($I368>$B$16,R367+($B$21-R367)*R$74-R$72,R367-R367/R$74),IF($I368>$B$17,R367+($B$21-R367)*R$74-R$72,R367-R367/R$74))","v":2.2000000000000002},2.2000000000000002,0,0,0,0,0,0,0,0,0]
[1,2.9299999999999815,2.6484400000000043,2.6634400000000045,2.6907799999999971,{"$f":"E369+$F$74","v":2.7057799999999972},2.0925000000000007,2.1075000000000008,{"$f":"IF($B$7=constants!$C$60,G369,IF($B$8=constants!$C$60,C369,E369))","v":2.6907799999999971},{"$f":"IF($B$7=constants!$C$60,H369,IF($B$8=constants!$C$60,D369,F369))","v":2.7057799999999972},1,2.6907799999999971,2.6,2.6,{"$f":"IF(OR($B$22=constants!$B$60,AND(I369>$B$12,$B$12<>-1)),O368+(N369-O368)*$O$74,O368+(L369-O368)*$O$74)","v":2.6906177777777747},2.6706177777777746,2.2000000000000002,2.2000000000000002,0,0,0,0,0,0,0,0,0]
[1,2.9399999999999813,2.6455200000000048,2.6605200000000049,2.6922399999999969,2.707239999999997,2.0915000000000008,2.1065000000000009,{"$f":"IF($B$7=constants!$C$60,G370,IF($B$8=constants!$C$60,C370,E370))","v":2.6922399999999969},{"$f":"IF($B$7=constants!$C$60,H370,IF($B$8=constants!$C$60,D370,F370))","v":2.707239999999997},1,2.6922399999999969,{"$f":"IF($K370=0,IF($I370>$B$16,M369+($B$20-M369)*M$74-K$72,M369-M369/M$74),IF($I370>$B$17,M369+($B$20-M369)*M$74-K$72,M369-M369/M$74))","v":2.6},2.6,{"$f":"IF(OR($B$22=constants!$B$60,AND(I370>$B$12,$B$12<>-1)),O369+(N370-O369)*$O$74,O369+(L370-O369)*$O$74)","v":2.6920777777777745},2.6720777777777744,2.2000000000000002,2.2000000000000002,0,0,0,0,0,0,0,0,0]
[1,2.9499999999999811,2.6426000000000047,2.6576000000000048,2.6936999999999971,2.7086999999999972,2.0905000000000009,2.105500000000001,{"$f":"IF($B$7=constants!$C$60,G371,IF($B$8=constants!$C$60,C371,E371))","v":2.6936999999999971},{"$f":"IF($B$7=constants!$C$60,H371,IF($B$8=constants!$C$60,D371,F371))","v":2.7086999999999972},1,2.6936999999999971,2.6,2.6,{"$f":"IF(OR($B$22=constants!$B$60,AND(I371>$B$12,$B$12<>-1)),O370+(N371-O370)*$O$74,O370+(L371-O370)*$O$74)","v":2.6935377777777747},2.6735377777777747,2.2000000000000002,2.2000000000000002,0,0,0,0,0,0,0,0,0]
[1,2.9599999999999809,2.6396800000000047,2.6546800000000048,2.6951599999999969,2.710159999999997,2.0895000000000006,2.1045000000000007,{"$f":"IF($B$7=constants!$C$60,G372,IF($B$8=constants!$C$60,C372,E372))","v":2.6951599999999969},{"$f":"IF($B$7=constants!$C$60,H372,IF($B$8=constants!$C$60,D372,F372))","v":2.710159999999997},1,2.6951599999999969,2.6,2.6,{"$f":"IF(OR($B$22=constants!$B$60,AND(I372>$B$12,$B$12<>-1)),O371+(N372-O371)*$O$74,O371+(L372-O371)*$O$74)","v":2.6949977777777745},2.6749977777777745,2.2000000000000002,2.2000000000000002,0,0,0,0,0,0,0,0,0]
[1,2.9699999999999807,2.6367600000000051,{"$f":"C373+$D$74","v":2.6517600000000052},2.6966199999999967,2.7116199999999968,2.0885000000000007,2.1035000000000008,{"$f":"IF($B$7=constants!$C$60,G373,IF($B$8=constants!$C$60,C373,E373))","v":2.6966199999999967},{"$f":"IF($B$7=constants!$C$60,H373,IF($B$8=constants!$C$60,D373,F373))","v":2.7116199999999968},1,2.6966199999999967,2.6,2.6,{"$f":"IF(OR($B$22=constants!$B$60,AND(I373>$B$12,$B$12<>-1)),O372+(N373-O372)*$O$74,O372+(L373-O372)*$O$74)","v":2.6964577777777743},2.6764577777777743,2.2000000000000002,2.2000000000000002,0,0,0,0,0,0,0,0,0]
[1,2.9799999999999804,2.6338400000000051,2.6488400000000052,2.6980799999999969,2.713079999999997,2.0875000000000008,2.1025000000000009,{"$f":"IF($B$7=constants!$C$60,G374,IF($B$8=constants!$C$60,C374,E374))","v":2.6980799999999969},{"$f":"IF($B$7=constants!$C$60,H374,IF($B$8=constants!$C$60,D374,F374))","v":2.713079999999997},1,2.6980799999999969,2.6,2.6,{"$f":"IF(OR($B$22=constants!$B$60,AND(I374>$B$12,$B$12<>-1)),O373+(N374-O373)*$O$74,O373+(L374-O373)*$O$74)","v":2.6979177777777745},2.6779177777777745,2.2000000000000002,2.2000000000000002,0,0,0,0,0,0,0,0,0]
[1,2.9899999999999802,2.630920000000005,2.6459200000000052,2.6995399999999967,2.7145399999999968,2.0865000000000009,2.101500000000001,{"$f":"IF($B$7=constants!$C$60,G375,IF($B$8=constants!$C$60,C375,E375))","v":2.6995399999999967},{"$f":"IF($B$7=constants!$C$60,H375,IF($B$8=constants!$C$60,D375,F375))","v":2.7145399999999968},1,2.6995399999999967,2.6,2.6,{"$f":"IF(OR($B$22=constants!$B$60,AND(I375>$B$12,$B$12<>-1)),O374+(N375-O374)*$O$74,O374+(L375-O374)*$O$74)","v":2.6993777777777743},2.6793777777777743,2.2000000000000002,2.2000000000000002,0,0,0,0,0,0,0,0,0]
[1,2.99999999999998,2.628000000000005,2.6430000000000051,2.7009999999999965,2.7159999999999966,2.085500000000001,2.1005000000000011,{"$f":"IF($B$7=constants!$C$60,G376,IF($B$8=constants!$C$60,C376,E376))","v":2.7009999999999965},{"$f":"IF($B$7=constants!$C$60,H376,IF($B$8=constants!$C$60,D376,F376))","v":2.7159999999999966},1,2.7009999999999965,2.6,2.6,{"$f":"IF(OR($B$22=constants!$B$60,AND(I376>$B$12,$B$12<>-1)),O375+(N376-O375)*$O$74,O375+(L376-O375)*$O$74)","v":2.7008377777777741},2.6808377777777741,2.2000000000000002,2.2000000000000002,0,0,0,0,0,0,0,0,0]